{"text_format":"3","workbook":"xlsx","n_sheets":7,"sheets":["Reglement","Score","PremierLeague","Points","Classement","ClassementEQ","TEMP"],"not_rendered":{"images":2,"macros":1,"defined_names":310},"read":"whole","date_system":"1900"}

{"sheet":"Reglement","index":0,"n_rows":54,"n_cols":25,"rows_kept":54}
[{"$nulls":17},"Cotes",1,0,"English","Français","Español","Italiano","日本語"]
[{"$nulls":17},"Poules",null,null,"BARCLAYS PREMIER LEAGUE - 2019 / 2020","CHAMPIONNAT D'ANGLETERRE - PREMIER LEAGUE - SAISON 2019-2020","CAMPEONATO INGLES - PREMIER LEAGUE - 2019 / 2020","PREMIER LEAGUE - 2019 / 2020","PREMIER LEAGUE - 2019 / 2020"]
[null,null,{"$f":"\"CONCOURS 'Pronostics \"&R51&\"'\"","v":"CONCOURS 'Pronostics Premier League'"},{"$f":"\"CONTEST 'Prediction \"&R51&\"'\"","v":"CONTEST 'Prediction Premier League'"},{"$f":"\"CONCURSO 'Pronosticos \"&R51&\"'\"","v":"CONCURSO 'Pronosticos Premier League'"},{"$nulls":12},"\"Tout-pile\"",5,null,"ODDS","COTES","POSIBILIDADES","PROBABILITA","オッズ"]
[{"$nulls":17},"Bon prono",3,null,"Arsenal FC","Arsenal","Arsenal","Arsenal","アーセナル"]
[null,null,"OBJET DU CONCOURS","CONTEST PURPOSE","OBJETO DEL CONCURSO",{"$nulls":12},"Phase Finale",null,null,"Aston Villa","Aston Villa","Aston Villa","Aston Villa","アストン・ヴィラ"]
[{"$nulls":17},"\"Tout-pile\"",10,null,"AFC Bournemouth","Bournemouth","Bournemouth","Bournemouth","ボーンマス"]
[null,null,{"$f":"\"Le concours 'Pronostics \"&R51&\"' est un jeu permettant à ses participants de pronostiquer les résultats du championnat \"&R53&\" \"&R51&\" \"&R52","v":"Le concours 'Pronostics Premier League' est un jeu permettant à ses participants de pronostiquer les résultats du championnat d'Angleterre Premier League 2019-2020"},{"$f":"\"The contest 'Prediction \"&R51&\"' is a prediction game on the results of the French League \"&R51&\" \"&R52","v":"The contest 'Prediction Premier League' is a prediction game on the results of the French League Premier League 2019-2020"},{"$f":"\"El concurso 'Pronosticos \"&R51&\"' es un juego que permite pronosticar los resultados del campeonato frances \"&R51&\" \"&R52","v":"El concurso 'Pronosticos Premier League' es un juego que permite pronosticar los resultados del campeonato frances Premier League 2019-2020"},{"$nulls":12},"Bon prono",6,null,"Brighton & Hove Albion","Brighton","Brighton","Brighton","ブライトン&ホーヴ・アルビオン"]
[null,null,"Les participants devront valider plusieurs étapes - définies ci après - pour gagner un maximum de points. ","Participants have to validate several steps - depicted below - to earn the maximum of points.","Los participantes podrán validar varias etapas - definicidas despues - para ganar el máximo de puntos. ",{"$nulls":15},"Burnley FC","Burnley","Burnley","Burnley","バーンリー"]
[null,null,"Le classement des participants sera mis à jour quotidiennement pendant la période de la compétition (du 09/08/2019 au 17/05/2020).","The standings will be daily updated during the competition (from 09/08/2019 to 17/05/2020).","La clasificación de los participantes se actualiza diariamente durante la competencia (desde el 09/08/2019 hasta el 17/05/2020).",{"$nulls":15},"Chelsea FC","Chelsea","Chelsea","Chelsea","チェルシー"]
[{"$nulls":20},"Crystal Palace","Crystal Palace","Crystal Palace","Crystal Palace","クリスタル・パレス"]
[{"$nulls":20},"Everton FC","Everton","Everton","Everton","エヴァートン"]
[{"$nulls":20},"Leicester City","Leicester City","Leicester City","Leicester City","レスター・シティ"]
[{"$nulls":17},"Nb \"podium\"",5,null,"Liverpool FC","Liverpool","Liverpool","Liverpool","リヴァプール"]
[null,null,"REGLEMENT","RULES","REGLAS",{"$nulls":12},"Version","tieum78-v1",null,"Manchester City","Manchester City","Manchester City","Manchester City","マンチェスター・シティ"]
[{"$nulls":17},{"$f":"IF(S34=\"Français\",\"Automatique\",IF(S34=\"Español\",\"Automático\",\"Automatic\"))","v":"Automatique"},{"$f":"IF(S34=\"Français\",\"Classement\",IF(S34=\"Español\",\"Clasificación\",\"Ranking\"))","v":"Classement"},null,"Manchester United","Manchester United","Manchester United","Manchester United","マンチェスター・ユナイテッド"]
[null,null,"Avant chacune des 38 journées de championnats, les participants devront pronostiquer le résultat des 10 matchs de la journée.","Before every match day, the participants will predict the result of the 10 matches. (Tab \"Group stage\")","Antes cada día de partido, los participantes predecirán el resultado de los 10 partidos de la jornada.",{"$nulls":12},{"$f":"IF(S34=\"Français\",\"Manuel (journée \",IF(S34=\"Español\",\"Manual (jornada \",\"Manual Matchday #\"))&R21&\")\"","v":"Manuel (journée 1)"},{"$f":"IF(S34=\"Français\",\"Grille Journée n° \",IF(S34=\"Español\",\"Cuadricula Jornada #\",\"Game Grid Matchday #\"))&R21","v":"Grille Journée n° 1"},null,"Newcastle United","Newcastle","Newcastle","Newcastle","ニューカッスル・ユナイテッド"]
[null,null,{"$f":"IF(S1,\"Pour chacun des 10 matchs, des cotes seront proposées. Ces cotes ont été définies par le site de pari Betclic (tronquées à la première décimale).\",\"\")","v":"Pour chacun des 10 matchs, des cotes seront proposées. Ces cotes ont été définies par le site de pari Betclic (tronquées à la première décimale)."},{"$f":"IF(S1,\"For each of the 10 games, the odds are retrieved from Betclic betting site (truncated to one decimal).\",\"\")","v":"For each of the 10 games, the odds are retrieved from Betclic betting site (truncated to one decimal)."},{"$f":"IF(S1,\"Para cada uno de los 10 partidos, se proponen posibilidades. Estas posibilidades fueron definidas por el sitio Betclic (truncadas a la primera decimal).\",\"\")","v":"Para cada uno de los 10 partidos, se proponen posibilidades. Estas posibilidades fueron definidas por el sitio Betclic (truncadas a la primera decimal)."},{"$nulls":13},{"$f":"IF(S34=\"Français\",\"Relance Journée n° \",IF(S34=\"Español\",\"Recordatorio Jornada #\",\"Reminder Matchday #\"))&R21","v":"Relance Journée n° 1"},null,"Norwich City","Norwich","Norwich","Norwich","ノリッジ・シティ"]
[null,null,{"$f":"IF(S1,\"Les cotes sont également consultables sur le lien suivant \"&R54,\"\")","v":"Les cotes sont également consultables sur le lien suivant http://www.cotes.fr/football/Angleterre-Premier-League-ed2"},{"$f":"IF(S1,\"The odds are also available on this web site : \"&R54,\"\")","v":"The odds are also available on this web site : http://www.cotes.fr/football/Angleterre-Premier-League-ed2"},{"$f":"IF(S1,\"Las posibilidades también están disponibles en el enlace \"&R54,\"\")","v":"Las posibilidades también están disponibles en el enlace http://www.cotes.fr/football/Angleterre-Premier-League-ed2"},{"$nulls":13},{"$f":"IF(S34=\"Français\",\"Détail Journée n°\",IF(S34=\"Español\",\"Jornada Detalle #\",\"Matchday Detail #\"))&R21","v":"Détail Journée n°1"},null,"Sheffield United","Sheffield United","Sheffield United","Sheffield United","シェフィールド・ユナイテッド"]
[null,null,"Le barême des points appliqué à chacun des 10 matchs est le suivant : ","The points scale to each of the 10 matches is as follows:","La escala de puntos applicada a cada uno de los 10 partidos es la siguiente : ",{"$nulls":15},"Southampton FC","Southampton","Southampton","Southampton","サウサンプトン"]
[null,null,{"$f":"CONCATENATE(\"- en cas de bon pronostic sans le score, le joueur gagnera \",S4,IF(S1,\" * la cote du pronostic\",\" points\"))","v":"- en cas de bon pronostic sans le score, le joueur gagnera 3 * la cote du pronostic"},{"$f":"CONCATENATE(\"- In case of correct prediction without the score, the player will win \",S4,IF(S1,\" * odd\",\" points\"))","v":"- In case of correct prediction without the score, the player will win 3 * odd"},{"$f":"CONCATENATE(\"- si buen pronóstico sin el resultado correcto, el jugador gana \",S4,IF(S1,\" * la posibilidade\",\" puntos\"))","v":"- si buen pronóstico sin el resultado correcto, el jugador gana 3 * la posibilidade"},{"$nulls":15},"Tottenham Hotspur","Tottenham","Tottenham","Tottenham","トッテナム・ホットスパー"]
[null,null,{"$f":"CONCATENATE(\"- en cas de bon pronostic avec le score exact, le joueur gagnera \",S3,IF(S1,\" * la cote du pronostic\",\" points\"))","v":"- en cas de bon pronostic avec le score exact, le joueur gagnera 5 * la cote du pronostic"},{"$f":"CONCATENATE(\"- In case of correct prediction with correct score, the player will win \",S3,IF(S1,\" * odd\",\" points\"))","v":"- In case of correct prediction with correct score, the player will win 5 * odd"},{"$f":"CONCATENATE(\"- si buen pronóstico con el resultado correcto, el jugador gana \",S3,IF(S1,\" * la posibilidade\",\" puntos\"))","v":"- si buen pronóstico con el resultado correcto, el jugador gana 5 * la posibilidade"},{"$nulls":12},1,null,true,"Watford FC","Watford","Watford","Watford","ワトフォード"]
[null,null,"- dans les autres cas, le joueur gagnera 0 point","- In the other case, the player will win 0 point","- en otros casos, el jugador gana 0 point",{"$nulls":14},false,"West Ham United","West Ham","West Ham","West Ham","ウェストハム・ユナイテッド"]
[{"$nulls":19},true,"Wolverhampton","Wolverhampton","Wolverhampton","Wolverhampton","ウルヴァーハンプトン・ワンダラーズ"]
[null,null,{"$f":"CONCATENATE(\"Simulation avec le match \",Points!C6,\" - \",Points!D6)","v":"Simulation avec le match Liverpool - Norwich"},{"$f":"CONCATENATE(\"Simulation with \",Points!C6,\" - \",Points!D6,\" match\")","v":"Simulation with Liverpool - Norwich match"},{"$f":"CONCATENATE(\"Simulación con el partido \",Points!C6,\" - \",Points!D6)","v":"Simulación con el partido Liverpool - Norwich"},{"$nulls":15},"WEDNESDAY","MERCREDI","MIERCOLES","MERCOLEDI","すいようび"]
[null,null,{"$f":"IF(S1,\"Les cotes sont de \"&Points!G6&\" pour une victoire de \"&Points!C6&\" , \"&Points!I6&\" pour une victoire de \"&Points!D6&\" et de \"&Points!H6&\" pour un match nul\",\"\")","v":"Les cotes sont de 3,1 pour une victoire de Liverpool , 2,1 pour une victoire de Norwich et de 3 pour un match nul"},{"$f":"IF(S1,CONCATENATE(\"The odds are \",Points!G6, \" for \",Points!C6,\" victory, \",Points!I6,\" for \",Points!D6,\" victory and \",Points!H6,\" for a draw match\"),\"\")","v":"The odds are 3,1 for Liverpool victory, 2,1 for Norwich victory and 3 for a draw match"},{"$f":"IF(S1,CONCATENATE(\"Las posibilidades son \",Points!G6, \" para una victoria de \",Points!C6,\" , \",Points!I6,\" para una victoria de \",Points!D6,\" y \",Points!H6,\" para un empate\"),\"\")","v":"Las posibilidades son 3,1 para una victoria de Liverpool , 2,1 para una victoria de Norwich y 3 para un empate"},{"$nulls":15},"SATURDAY","SAMEDI","SABADO","SABATO","どようび"]
[null,null,{"$f":"\"Dans l'exemple 1, \"&Points!C6&\" s'impose 1-0.\"","v":"Dans l'exemple 1, Liverpool s'impose 1-0."},{"$f":"\"Example 1 : \"&Points!C6&\" win 1-0.\"","v":"Example 1 : Liverpool win 1-0."},{"$f":"\"En el ejemplo 1, \"&Points!C6&\" vence 1-0.\"","v":"En el ejemplo 1, Liverpool vence 1-0."},{"$nulls":15},"SUNDAY","DIMANCHE","DOMINGO","DOMENICA","にちようび"]
[null,null,{"$f":"\"A l'issue de la rencontre, tous les joueurs ayant pronostiqué une victoire de \"&Points!C6&\" sur le score de 1-0 marquent \"&S3&IF(S1,\"*\"&Points!G6&\", soit \"&S3*Points!G6,\"\")&\" points.\"","v":"A l'issue de la rencontre, tous les joueurs ayant pronostiqué une victoire de Liverpool sur le score de 1-0 marquent 5*3,1, soit 15,5 points."},{"$f":"\"At the end of the game, all players who have predicted a victory for \"&Points!C6&\" with a score of 1-0 will score \"&S3&IF(S1,\"*\"&Points!G6&\", than \"&S3*Points!G6,\"\")&\" points.\"","v":"At the end of the game, all players who have predicted a victory for Liverpool with a score of 1-0 will score 5*3,1, than 15,5 points."},{"$f":"\"Después del partido, todos los jugadores que han predicho una victoria de \"&Points!C6&\" por 1-0 ganan \"&S3&IF(S1,\"*\"&Points!G6&\", entonces \"&S3*Points!G6,\"\")&\" puntos.\"","v":"Después del partido, todos los jugadores que han predicho una victoria de Liverpool por 1-0 ganan 5*3,1, entonces 15,5 puntos."},{"$nulls":14},3,"AUGUST","AOÛT","AGOSTO","AGOSTO","はちがつ"]
[null,null,{"$f":"\"Tous les joueurs ayant pronostiqué une victoire de \"&Points!C6&\" sur un score différent de 1-0 marquent \"&S4&IF(S1,\"*\"&Points!G6&\", soit \"&S4*Points!G6,\"\")&\" points\"","v":"Tous les joueurs ayant pronostiqué une victoire de Liverpool sur un score différent de 1-0 marquent 3*3,1, soit 9,3 points"},{"$f":"\"All players who have predicted a victory for \"&Points!C6&\" but with a different score than 1-0 will score \"&S4&IF(S1,\"*\"&Points!G6&\", than \"&S4*Points!G6,\"\")&\" points\"","v":"All players who have predicted a victory for Liverpool but with a different score than 1-0 will score 3*3,1, than 9,3 points"},{"$f":"\"Todos los jugadores que han predicho una victoria de \"&Points!C6&\" con un reultado differente de 1-0 ganan \"&S4&IF(S1,\"*\"&Points!G6&\", entonces \"&S4*Points!G6,\"\")&\" puntos\"","v":"Todos los jugadores que han predicho una victoria de Liverpool con un reultado differente de 1-0 ganan 3*3,1, entonces 9,3 puntos"},{"$nulls":12},"Bonus 4 buts",{"$f":"T27/T28","v":1.5},2,"SEPTEMBER","SEPTEMBRE","SEPTIEMBRE","SETTEMBRE","くがつ"]
[null,null,{"$f":"\"Tous les joueurs ayant pronostiqué une victoire de \"&Points!D6&\" ou un match nul marquent 0 point.\"","v":"Tous les joueurs ayant pronostiqué une victoire de Norwich ou un match nul marquent 0 point."},{"$f":"\"All players who have predicted a victory for \"&Points!D6&\" or a draw, will win 0 point.\"","v":"All players who have predicted a victory for Norwich or a draw, will win 0 point."},{"$f":"\"Todos los jugadores que han predicho una victoria de \"&Points!C6&\" o un empate ganan 0 point.\"","v":"Todos los jugadores que han predicho una victoria de Liverpool o un empate ganan 0 point."},{"$nulls":12},"Bonus 6 buts",2,null,"OCTOBER","OCTOBRE","OCTUBRE","OTTOBRE","  じゅうがつ"]
[null,null,{"$f":"\"Dans l'exemple 2, \"&Points!D6&\" s'impose 1-0.\"","v":"Dans l'exemple 2, Norwich s'impose 1-0."},{"$f":"\"Example 2 : \"&Points!D6&\" win 1-0.\"","v":"Example 2 : Norwich win 1-0."},{"$f":"\"En el ejemplo 2, \"&Points!D6&\" vence 1-0.\"","v":"En el ejemplo 2, Norwich vence 1-0."},{"$nulls":12},"Diffusion","Cci",null,"NOVEMBER","NOVEMBRE","NOVIEMBRE","NOVEMBRE","じゅういちがつ"]
[null,null,{"$f":"\"A l'issue de la rencontre, tous les joueurs ayant pronostiqué une victoire de \"&Points!D6&\" sur le score de 1-0 marquent \"&S3&IF(S1,\"*\"&Points!I6&\", soit \"&S3*Points!I6,\"\")&\" points.\"","v":"A l'issue de la rencontre, tous les joueurs ayant pronostiqué une victoire de Norwich sur le score de 1-0 marquent 5*2,1, soit 10,5 points."},{"$f":"\"At the end of the game, all players who have predicted a victory for \"&Points!D6&\" with a score of 1-0 will win \"&S3&IF(S1,\"*\"&Points!I6&\", than \"&S3*Points!I6,\"\")&\" points.\"","v":"At the end of the game, all players who have predicted a victory for Norwich with a score of 1-0 will win 5*2,1, than 10,5 points."},{"$f":"\"Después del partido, todos los jugadores que han predicho una victoria de \"&Points!D6&\" por 1-0 ganan \"&S3&IF(S1,\"*\"&Points!I6&\", entonces \"&S3*Points!I6,\"\")&\" puntos.\"","v":"Después del partido, todos los jugadores que han predicho una victoria de Norwich por 1-0 ganan 5*2,1, entonces 10,5 puntos."},{"$nulls":12},"Organisateur",null,"MBpl1920","DECEMBRE","DÉCEMBRE","DICIEMBRE","DICEMBRE","  じゅうにがつ"]
[null,null,{"$f":"\"Tous les joueurs ayant pronostiqué une victoire de \"&Points!D6&\" sur un score différent de 1-0 marquent \"&S4&IF(S1,\"*\"&Points!I6&\", soit \"&S4*Points!I6,\"\")&\" points\"","v":"Tous les joueurs ayant pronostiqué une victoire de Norwich sur un score différent de 1-0 marquent 3*2,1, soit 6,3 points"},{"$f":"\"All players who have predicted a victory for \"&Points!D6&\" but with a different score than 1-0 will win \"&S4&IF(S1,\"*\"&Points!I6&\", than \"&S4*Points!I6,\"\")&\" points\"","v":"All players who have predicted a victory for Norwich but with a different score than 1-0 will win 3*2,1, than 6,3 points"},{"$f":"\"Todos los jugadores que han predicho una victoria de \"&Points!D6&\" - con un resultado differente de 1-0 - ganan \"&S4&IF(S1,\"*\"&Points!I6&\", entonces \"&S4*Points!I6,\"\")&\" puntos\"","v":"Todos los jugadores que han predicho una victoria de Norwich - con un resultado differente de 1-0 - ganan 3*2,1, entonces 6,3 puntos"},{"$nulls":12},"Adressemail",null,null,"JANUARY","JANVIER","ENERO","GENNAIO","いちがつ"]
[null,null,{"$f":"\"Tous les joueurs ayant pronostiqué une victoire de \"&Points!C6&\" ou un match nul marquent 0 point.\"","v":"Tous les joueurs ayant pronostiqué une victoire de Liverpool ou un match nul marquent 0 point."},{"$f":"\"All players who have predicted a victory for \"&Points!C6&\" or a draw, will win 0 point.\"","v":"All players who have predicted a victory for Liverpool or a draw, will win 0 point."},{"$f":"\"Todos los jugadores que han predicho una victoria de \"&Points!D6&\" o un empate ganan 0 point.\"","v":"Todos los jugadores que han predicho una victoria de Norwich o un empate ganan 0 point."},{"$nulls":12},"Outlook / Gmail",true,false,"FEBRUARY","FÉVRIER","FEBRERO","FEBBRAIO","にがつ"]
[{"$nulls":17},"English","Français",22,"MARCH","MARS","MARZO","MARZO","さんがつ"]
[null,null,{"$f":"IF(OR(S28>1,S29>1),\"En outre, un bonus sera décerné lorsque le parieur aura identifié les matchs prolifiques, c’est-à-dire les matchs au cours desquels plus de 3 buts sont marqués.\",\"\")","v":"En outre, un bonus sera décerné lorsque le parieur aura identifié les matchs prolifiques, c’est-à-dire les matchs au cours desquels plus de 3 buts sont marqués."},{"$f":"IF(OR(S28>1,S29>1),\"An extra bonus will be earned for participants who predicted prolific games (if four - or more - goals scored in the match)\",\"\")","v":"An extra bonus will be earned for participants who predicted prolific games (if four - or more - goals scored in the match)"},{"$f":"IF(OR(S28>1,S29>1),\"Además, un bono será otorgado cuando el jugador ha identificado los partidos prolíficos, es decir los partidos con 4 goles o más.\",\"\")","v":"Además, un bono será otorgado cuando el jugador ha identificado los partidos prolíficos, es decir los partidos con 4 goles o más."},{"$nulls":12},"Français",null,null,"APRIL","AVRIL","ABRIL","APRILE","しがつ"]
[null,null,{"$f":"IF(OR(S28>1,S29>1),\"Le score du parieur sera ainsi multiplié \"&IF(S28>1,\"par \"&S28&\" s'il a trouvé que 4 ou 5 buts seraient marqués dans le match, et multiplié \",\"\")&\"par \"&S29&\" si 6 buts ou plus ont été marqués\",\"\")","v":"Le score du parieur sera ainsi multiplié par 1,5 s'il a trouvé que 4 ou 5 buts seraient marqués dans le match, et multiplié par 2 si 6 buts ou plus ont été marqués"},{"$f":"IF(OR(S28>1,S29>1),\"The score of the player will be multiplied \"&IF(S28>1,\"by \"&S28&\" if he predicted a game with 4 or 5 goals, or multiplied \",\"\")&\"by \"&S29&\" for a game with 6 or more goals\",\"\")","v":"The score of the player will be multiplied by 1,5 if he predicted a game with 4 or 5 goals, or multiplied by 2 for a game with 6 or more goals"},{"$f":"IF(OR(S28>1,S29>1),\"El puntaje del jugador se multiplica \"&IF(S28>1,\"por \"&S28&\" si 4 o 5 goles fueron marcados en el partido, o multiplicada \",\"\")&\"por \"&S29&\" si 6 goles (o más) fueron marcados\",\"\")","v":"El puntaje del jugador se multiplica por 1,5 si 4 o 5 goles fueron marcados en el partido, o multiplicada por 2 si 6 goles (o más) fueron marcados"},{"$nulls":12},"Español",null,null,"MAY","MAI","MAYO","MAGGIO","ごがつ"]
[null,null,{"$f":"IF(OR(S28>1,S29>1),\"Dans l'exemple 3, \"&Points!C6&\" s'impose 4-2.\",\"\")","v":"Dans l'exemple 3, Liverpool s'impose 4-2."},{"$f":"IF(OR(S28>1,S29>1),\"Example 3 : \"&Points!C6& \" win 4-2.\",\"\")","v":"Example 3 : Liverpool win 4-2."},{"$f":"IF(OR(S28>1,S29>1),\"En el ejemplo 3, \"&Points!C6& \" vence 4-2.\",\"\")","v":"En el ejemplo 3, Liverpool vence 4-2."},{"$nulls":12},"Italiano",null,null,"HOME","DOMICILE","EN_CASA","CASA","ホームゲーム"]
[null,null,{"$f":"IF(OR(S28>1,S29>1),CONCATENATE(\"Tous les joueurs ayant pronostiqué une victoire de \",Points!C6,\" sur le score de 4-2 marquent \",S29,\"*\",S3,IF(S1,CONCATENATE(\"*\",Points!G6,\", soit \",S29*S3*Points!G6,\" points.\"),\" soit \"&S29*S3&\" points.\")),\"\")","v":"Tous les joueurs ayant pronostiqué une victoire de Liverpool sur le score de 4-2 marquent 2*5*3,1, soit 31 points."},{"$f":"IF(OR(S28>1,S29>1),\"At the end of the game, all players who have predicted a victory for \"&Points!C6&\" with a score of 4-2 will win \"&S3&IF(S1,\" * \"&Points!G6,\"\")&\" * \"&S29&\", than \"&S3*Points!G6*S29&\" points.\",\"\")","v":"At the end of the game, all players who have predicted a victory for Liverpool with a score of 4-2 will win 5 * 3,1 * 2, than 31 points."},{"$f":"IF(OR(S28>1,S29>1),\"Después del partido, todos los jugadores que han predicho una victoria de \"&Points!C6&\" por 4-2 ganan \"&S3&IF(S1,\" * \"&Points!G6,\"\")&\" * \"&S29&\", entonces \"&S3*Points!G6*S29&\" puntos.\",\"\")","v":"Después del partido, todos los jugadores que han predicho una victoria de Liverpool por 4-2 ganan 5 * 3,1 * 2, entonces 31 puntos."},{"$nulls":12},"日本語",null,null,"AWAY","EXTERIEUR","FUERA","FUORI_CASA","遠征試合"]
[null,null,{"$f":"IF(OR(S28>1,S29>1),CONCATENATE(\"Tous les joueurs ayant pronostiqué une victoire de \",Points!C6,\" sur le score de 5-1, 6-2, 6-0, etc... marquent \",S29,\"*\",S4,IF(S1,CONCATENATE(\"*\",Points!G6,\", soit \",S29*S4*Points!G6,\" points.\"),\" soit \"&S29*S4&\" points.\")),\"\")","v":"Tous les joueurs ayant pronostiqué une victoire de Liverpool sur le score de 5-1, 6-2, 6-0, etc... marquent 2*3*3,1, soit 18,6 points."},{"$f":"IF(OR(S28>1,S29>1),\"All players who have predicted a victory for \"&Points!C6&\" with a score of 5-1, 6-2, 6-0, etc... will win \"&S4&IF(S1,\" * \"&Points!G6,\"\")&\" * \"&S29&\", than \"&S4*Points!G6*S29&\" points.\",\"\")","v":"All players who have predicted a victory for Liverpool with a score of 5-1, 6-2, 6-0, etc... will win 3 * 3,1 * 2, than 18,6 points."},{"$f":"IF(OR(S28>1,S29>1),\"Todos los jugadores que han predicho una victoria de \"&Points!C6&\" por 5-1, 6-2, 6-0, etc... ganan \"&S4&IF(S1,\" * \"&Points!G6,\"\")&\" * \"&S29&\", entonces \"&S4*Points!G6*S29&\" puntos.\",\"\")","v":"Todos los jugadores que han predicho una victoria de Liverpool por 5-1, 6-2, 6-0, etc... ganan 3 * 3,1 * 2, entonces 18,6 puntos."},{"$nulls":15},"MATCHDAY","JOURNEE","JORNADA","GIORNATA","試合の日"]
[null,null,{"$f":"IF(OR(S28>1,S29>1),CONCATENATE(\"Tous les joueurs ayant pronostiqué une victoire de \",Points!C6,\" sur le score de 3-1, 3-2, 4-0, etc... marquent \",S28,\"*\",S4,IF(S1,CONCATENATE(\"*\",Points!G6,\", soit \",S28*S4*Points!G6,\" points.\"),\" soit \"&S28*S4&\" points.\")),\"\")","v":"Tous les joueurs ayant pronostiqué une victoire de Liverpool sur le score de 3-1, 3-2, 4-0, etc... marquent 1,5*3*3,1, soit 13,95 points."},{"$f":"IF(OR(S28>1,S29>1),\"All players who have predicted a victory for \"&Points!C6&\" with a score of 3-1, 3-2, 4-0, etc... will win \"&S4&IF(S1,\" * \"&Points!G6,\"\")&\" * \"&S28&\", than \"&S4*Points!G6*S28&\" points.\",\"\")","v":"All players who have predicted a victory for Liverpool with a score of 3-1, 3-2, 4-0, etc... will win 3 * 3,1 * 1,5, than 13,95 points."},{"$f":"IF(OR(S28>1,S29>1),\"Todos los jugadores que han predicho una victoria de \"&Points!C6&\" por 3-1, 3-2, 4-0, etc... ganan \"&S4&IF(S1,\" * \"&Points!G6,\"\")&\" * \"&S28&\", entonces \"&S4*Points!G6*S28&\" puntos.\",\"\")","v":"Todos los jugadores que han predicho una victoria de Liverpool por 3-1, 3-2, 4-0, etc... ganan 3 * 3,1 * 1,5, entonces 13,95 puntos."},{"$nulls":15},"#","n°","#","#","#"]
[{"$nulls":17},"Bonus Championnat",25,8]
[null,null,{"$f":"IF(S41>0,\"A l'issue de chaque journée de championnat, quand les 10 matchs ont été joués, le meilleur pronostiqueur de la journée remporte un bonus de \"&S41&\" points\",\"\")","v":"A l'issue de chaque journée de championnat, quand les 10 matchs ont été joués, le meilleur pronostiqueur de la journée remporte un bonus de 25 points"},{"$f":"IF(S41>0,\"At the end of each matchday, when the 10 games have been played, the best tipster will win a bonus of \"&S41&\" points\",\"\")","v":"At the end of each matchday, when the 10 games have been played, the best tipster will win a bonus of 25 points"},{"$f":"IF(S41>0,\"Al final de cada jornada, cuando se hayan jugado los 10 juegos, el mejor competidor ganará una bonificación de \"&S41&\" puntos\",\"\")","v":"Al final de cada jornada, cuando se hayan jugado los 10 juegos, el mejor competidor ganará una bonificación de 25 puntos"},{"$nulls":12},4,18,6]
[null,null,{"$f":"IF(COUNTIF(S41:T45,\">1\")>1,\"Les \"&COUNTIF(S41:T45,\">0\")&\" meilleurs pronostiqueurs sont aussi recompensés et recoivent un bonus décroissant, fonction de leur classement : \"&S46,\"\")","v":"Les 10 meilleurs pronostiqueurs sont aussi recompensés et recoivent un bonus décroissant, fonction de leur classement : 25,18,15,13,10,8,6,4,2,1"},{"$f":"IF(COUNTIF(S41:T45,\">1\")>1,\"The \"&COUNTIF(S41:T45,\">0\")&\" best are also rewarded and receive a decreasing bonus, depending on their ranking : \"&S46,\"\")","v":"The 10 best are also rewarded and receive a decreasing bonus, depending on their ranking : 25,18,15,13,10,8,6,4,2,1"},{"$f":"IF(COUNTIF(S41:T45,\">1\")>1,\"Los \"&COUNTIF(S41:T45,\">0\")&\" mejores también son recompensados y reciben una bonificación decreciente, dependiendo de su clasificación : \"&S46,\"\")","v":"Los 10 mejores también son recompensados y reciben una bonificación decreciente, dependiendo de su clasificación : 25,18,15,13,10,8,6,4,2,1"},{"$nulls":12},10,15,4]
[null,null,{"$f":"IF(SUM(R42:R46)>0,\"A l'issue de chaque journée de championnat, quand les 10 matchs ont été joués, les pronostiqueurs les plus fiables sur la journée de championnat remportent les bonus suivants :\",\"\")","v":"A l'issue de chaque journée de championnat, quand les 10 matchs ont été joués, les pronostiqueurs les plus fiables sur la journée de championnat remportent les bonus suivants :"},{"$f":"IF(SUM(R42:R46)>0,\"At the end of each matchday, when the 10 matches have been played, the most reliable predictors win the following bonuses :\",\"\")","v":"At the end of each matchday, when the 10 matches have been played, the most reliable predictors win the following bonuses :"},{"$f":"IF(SUM(R42:R46)>0,\"Al final de cada jornada, cuando se han jugado los 10 partidos, los competidores más confiables en la jornada ganan las siguientes bonificaciones:\",\"\")","v":"Al final de cada jornada, cuando se han jugado los 10 partidos, los competidores más confiables en la jornada ganan las siguientes bonificaciones:"},{"$nulls":12},20,13,2]
[null,null,{"$f":"IF(R42>0,R42&\" points pour 6 bons pronostics, \",\"\")&IF(R43>0,R43&\" points pour 7 bons pronostics, \",\"\")&IF(R44>0,R44&\" points pour 8 bons pronostics, \",\"\")&IF(R45>0,R45&\" points pour 9 bons pronostics, \",\"\")&IF(R46>0,R46&\" points pour 10 bons pronostics\",\"\")","v":"4 points pour 6 bons pronostics, 10 points pour 7 bons pronostics, 20 points pour 8 bons pronostics, 35 points pour 9 bons pronostics, 60 points pour 10 bons pronostics"},{"$f":"IF(R42>0,R42&\" points for 6 good predictions, \",\"\")&IF(R43>0,R43&\" points for 7 good predictions, \",\"\")&IF(R44>0,R44&\" points for 8 good predictions, \",\"\")&IF(R45>0,R45&\" points for 9 good predictions, \",\"\")&IF(R46>0,R46&\" points for 10 good predictions\",\"\")","v":"4 points for 6 good predictions, 10 points for 7 good predictions, 20 points for 8 good predictions, 35 points for 9 good predictions, 60 points for 10 good predictions"},{"$f":"IF(R42>0,R42&\" puntos por 6 buenas predicciones, \",\"\")&IF(R43>0,R43&\" puntos por 7 buenas predicciones, \",\"\")&IF(R44>0,R44&\" puntos por 8 buenas predicciones, \",\"\")&IF(R45>0,R45&\" puntos por 9 buenas predicciones, \",\"\")&IF(R46>0,R46&\" puntos por 10 buenas predicciones\",\"\")","v":"4 puntos por 6 buenas predicciones, 10 puntos por 7 buenas predicciones, 20 puntos por 8 buenas predicciones, 35 puntos por 9 buenas predicciones, 60 puntos por 10 buenas predicciones"},{"$nulls":12},35,10,1]
[{"$nulls":17},60,{"$f":"IF(S41>0,S41&IF(S42>0,\",\" &S42&IF(S43>0,\",\" &S43&IF(S44>0,\",\" &S44&IF(S45>0,\",\" &S45&IF(T41>0,\",\" &T41&IF(T42>0,\",\" &T42&IF(T43>0,\",\" &T43&IF(T44>0,\",\" &T44&IF(T45>0,\",\" &T45,\"\"),\"\"),\"\"),\"\"),\"\"),\"\"),\"\"),\"\"),\"\"),\"\")","v":"25,18,15,13,10,8,6,4,2,1"}]
[]
[{"$nulls":17},"Affichage équipes",1,0]
[{"$nulls":17},"Blocage fonction",1]
[]
[{"$nulls":17},"Premier League"]
[{"$nulls":17},"2019-2020"]
[{"$nulls":17},"d'Angleterre"]
[null,"http://orgaprono.free.fr",{"$nulls":15},"http://www.cotes.fr/football/Angleterre-Premier-League-ed2"]

{"sheet":"Score","index":1,"n_rows":250,"n_cols":27,"rows_kept":250,"merged":[[1,5,2,22],[4,5,4,8],[4,19,4,22],[5,5,5,8],[5,19,5,22],[17,5,17,8],[17,19,17,22],[18,5,18,8],[18,19,18,22],[30,5,30,8],[30,19,30,22],[31,5,31,8],[31,19,31,22],[43,5,43,8],[43,19,43,22],[44,5,44,8],[44,19,44,22],[56,5,56,8],[56,19,56,22],[57,5,57,8],[57,19,57,22],[69,5,69,8],[69,19,69,22],[70,5,70,8],[70,19,70,22],[82,5,82,8],[82,19,82,22],[83,5,83,8],[83,19,83,22],[95,5,95,8],[95,19,95,22],[96,5,96,8],[96,19,96,22],[108,5,108,8],[108,19,108,22],[109,5,109,8],[109,19,109,22],[121,5,121,8],[121,19,121,22],[122,5,122,8],[122,19,122,22],[134,5,134,8],[134,19,134,22],[135,5,135,8],[135,19,135,22],[147,5,147,8],[147,19,147,22],[148,5,148,8],[148,19,148,22],[160,5,160,8],[160,19,160,22],[161,5,161,8],[161,19,161,22],[173,5,173,8],[173,19,173,22],[174,5,174,8],[174,19,174,22],[186,5,186,8],[186,19,186,22],[187,5,187,8],[187,19,187,22],[199,5,199,8],[199,19,199,22],[200,5,200,8],[200,19,200,22],[212,5,212,8],[212,19,212,22],[213,5,213,8],[213,19,213,22],[225,5,225,8],[225,19,225,22],[226,5,226,8],[226,19,226,22],[238,5,238,8],[238,19,238,22],[239,5,239,8],[239,19,239,22]]}
[]
[{"$nulls":5},{"$f":"UPPER(\"CHAMPIONNAT \"&Reglement!R53&\" - \"&Reglement!R51&\" - SAISON \"&Reglement!R52)","v":"CHAMPIONNAT D'ANGLETERRE - PREMIER LEAGUE - SAISON 2019-2020"}]
[]
[]
[{"$nulls":5},"JOURNEE n°1",{"$nulls":13},"JOURNEE n°20"]
[{"$nulls":5},"SAMEDI 10 AOÛT 2019",{"$nulls":13},"SAMEDI 28 DÉCEMBRE 2019"]
[null,{"$f":"IF(AND(G7=\"\",H7=\"\"),\"\",IF(G7<H7,0,IF(H7<G7,3,IF(G7=H7,1,\"\"))))","v":""},{"$f":"IF(G7>H7,1,0)","v":0},{"$f":"IF(AND(G7=\"\",H7=\"\"),\"\",IF(G7=H7,1,0))","v":""},{"$f":"IF(G7<H7,1,0)","v":0},"Liverpool",null,null,"Norwich",{"$f":"IF(G7<H7,1,0)","v":0},{"$f":"IF(AND(G7=\"\",H7=\"\"),\"\",IF(G7=H7,1,0))","v":""},{"$f":"IF(G7>H7,1,0)","v":0},{"$f":"IF(AND(G7=\"\",H7=\"\"),\"\",IF(G7>H7,0,IF(H7>G7,3,IF(G7=H7,1,\"\"))))","v":""},null,null,{"$f":"IF(AND(U7=\"\",V7=\"\"),\"\",IF(U7<V7,0,IF(V7<U7,3,IF(U7=V7,1,\"\"))))","v":""},{"$f":"IF(U7>V7,1,0)","v":0},{"$f":"IF(AND(U7=\"\",V7=\"\"),\"\",IF(U7=V7,1,0))","v":""},{"$f":"IF(U7<V7,1,0)","v":0},"Arsenal",null,null,"Chelsea",{"$f":"IF(U7<V7,1,0)","v":0},{"$f":"IF(AND(U7=\"\",V7=\"\"),\"\",IF(U7=V7,1,0))","v":""},{"$f":"IF(U7>V7,1,0)","v":0},{"$f":"IF(AND(U7=\"\",V7=\"\"),\"\",IF(U7>V7,0,IF(V7>U7,3,IF(U7=V7,1,\"\"))))","v":""}]
[null,"",0,"",0,"West Ham",null,null,"Manchester City",0,"",0,"",null,null,"",0,"",0,"Brighton",null,null,"Bournemouth",0,"",0,""]
[null,"",0,"",0,"Bournemouth",null,null,"Sheffield United",0,"",0,"",null,null,"",0,"",0,"Burnley",null,null,"Manchester United",0,"",0,""]
[null,"",0,"",0,"Burnley",null,null,"Southampton",0,"",0,"",null,null,"",0,"",0,"Liverpool",null,null,"Wolverhampton",0,"",0,""]
[null,"",0,"",0,"Crystal Palace",null,null,"Everton",0,"",0,"",null,null,"",0,"",0,"Manchester City",null,null,"Sheffield United",0,"",0,""]
[null,"",0,"",0,"Watford",null,null,"Brighton",0,"",0,"",null,null,"",0,"",0,"Newcastle",null,null,"Everton",0,"",0,""]
[null,"",0,"",0,"Tottenham",null,null,"Aston Villa",0,"",0,"",null,null,"",0,"",0,"Norwich",null,null,"Tottenham",0,"",0,""]
[null,"",0,"",0,"Leicester City",null,null,"Wolverhampton",0,"",0,"",null,null,"",0,"",0,"Southampton",null,null,"Crystal Palace",0,"",0,""]
[null,"",0,"",0,"Newcastle",null,null,"Arsenal",0,"",0,"",null,null,"",0,"",0,"Watford",null,null,"Aston Villa",0,"",0,""]
[null,"",0,"",0,"Manchester United",null,null,"Chelsea",0,"",0,"",null,null,"",0,"",0,"West Ham",null,null,"Leicester City",0,"",0,""]
[]
[{"$nulls":5},"JOURNEE n°2",{"$nulls":13},"JOURNEE n°21"]
[{"$nulls":5},"SAMEDI 17 AOÛT 2019",{"$nulls":13},"MERCREDI 01 JANVIER 2020"]
[null,{"$f":"IF(AND(G20=\"\",H20=\"\"),\"\",IF(G20<H20,0,IF(H20<G20,3,IF(G20=H20,1,\"\"))))","v":""},{"$f":"IF(G20>H20,1,0)","v":0},{"$f":"IF(AND(G20=\"\",H20=\"\"),\"\",IF(G20=H20,1,0))","v":""},{"$f":"IF(G20<H20,1,0)","v":0},"Arsenal",null,null,"Burnley",{"$f":"IF(G20<H20,1,0)","v":0},{"$f":"IF(AND(G20=\"\",H20=\"\"),\"\",IF(G20=H20,1,0))","v":""},{"$f":"IF(G20>H20,1,0)","v":0},{"$f":"IF(AND(G20=\"\",H20=\"\"),\"\",IF(G20>H20,0,IF(H20>G20,3,IF(G20=H20,1,\"\"))))","v":""},null,null,{"$f":"IF(AND(U20=\"\",V20=\"\"),\"\",IF(U20<V20,0,IF(V20<U20,3,IF(U20=V20,1,\"\"))))","v":""},{"$f":"IF(U20>V20,1,0)","v":0},{"$f":"IF(AND(U20=\"\",V20=\"\"),\"\",IF(U20=V20,1,0))","v":""},{"$f":"IF(U20<V20,1,0)","v":0},"Arsenal",null,null,"Manchester United",{"$f":"IF(U20<V20,1,0)","v":0},{"$f":"IF(AND(U20=\"\",V20=\"\"),\"\",IF(U20=V20,1,0))","v":""},{"$f":"IF(U20>V20,1,0)","v":0},{"$f":"IF(AND(U20=\"\",V20=\"\"),\"\",IF(U20>V20,0,IF(V20>U20,3,IF(U20=V20,1,\"\"))))","v":""}]
[null,"",0,"",0,"Aston Villa",null,null,"Bournemouth",0,"",0,"",null,null,"",0,"",0,"Brighton",null,null,"Chelsea",0,"",0,""]
[null,"",0,"",0,"Brighton",null,null,"West Ham",0,"",0,"",null,null,"",0,"",0,"Burnley",null,null,"Aston Villa",0,"",0,""]
[null,"",0,"",0,"Chelsea",null,null,"Leicester City",0,"",0,"",null,null,"",0,"",0,"Liverpool",null,null,"Sheffield United",0,"",0,""]
[null,"",0,"",0,"Everton",null,null,"Watford",0,"",0,"",null,null,"",0,"",0,"Manchester City",null,null,"Everton",0,"",0,""]
[null,"",0,"",0,"Manchester City",null,null,"Tottenham",0,"",0,"",null,null,"",0,"",0,"Newcastle",null,null,"Leicester City",0,"",0,""]
[null,"",0,"",0,"Norwich",null,null,"Newcastle",0,"",0,"",null,null,"",0,"",0,"Norwich",null,null,"Crystal Palace",0,"",0,""]
[null,"",0,"",0,"Sheffield United",null,null,"Crystal Palace",0,"",0,"",null,null,"",0,"",0,"Southampton",null,null,"Tottenham",0,"",0,""]
[null,"",0,"",0,"Southampton",null,null,"Liverpool",0,"",0,"",null,null,"",0,"",0,"Watford",null,null,"Wolverhampton",0,"",0,""]
[null,"",0,"",0,"Wolverhampton",null,null,"Manchester United",0,"",0,"",null,null,"",0,"",0,"West Ham",null,null,"Bournemouth",0,"",0,""]
[]
[{"$nulls":5},"JOURNEE n°3",{"$nulls":13},"JOURNEE n°22"]
[{"$nulls":5},"SAMEDI 24 AOÛT 2019",{"$nulls":13},"SAMEDI 11 JANVIER 2020"]
[null,{"$f":"IF(AND(G33=\"\",H33=\"\"),\"\",IF(G33<H33,0,IF(H33<G33,3,IF(G33=H33,1,\"\"))))","v":""},{"$f":"IF(G33>H33,1,0)","v":0},{"$f":"IF(AND(G33=\"\",H33=\"\"),\"\",IF(G33=H33,1,0))","v":""},{"$f":"IF(G33<H33,1,0)","v":0},"Bournemouth",null,null,"Manchester City",{"$f":"IF(G33<H33,1,0)","v":0},{"$f":"IF(AND(G33=\"\",H33=\"\"),\"\",IF(G33=H33,1,0))","v":""},{"$f":"IF(G33>H33,1,0)","v":0},{"$f":"IF(AND(G33=\"\",H33=\"\"),\"\",IF(G33>H33,0,IF(H33>G33,3,IF(G33=H33,1,\"\"))))","v":""},null,null,{"$f":"IF(AND(U33=\"\",V33=\"\"),\"\",IF(U33<V33,0,IF(V33<U33,3,IF(U33=V33,1,\"\"))))","v":""},{"$f":"IF(U33>V33,1,0)","v":0},{"$f":"IF(AND(U33=\"\",V33=\"\"),\"\",IF(U33=V33,1,0))","v":""},{"$f":"IF(U33<V33,1,0)","v":0},"Bournemouth",null,null,"Watford",{"$f":"IF(U33<V33,1,0)","v":0},{"$f":"IF(AND(U33=\"\",V33=\"\"),\"\",IF(U33=V33,1,0))","v":""},{"$f":"IF(U33>V33,1,0)","v":0},{"$f":"IF(AND(U33=\"\",V33=\"\"),\"\",IF(U33>V33,0,IF(V33>U33,3,IF(U33=V33,1,\"\"))))","v":""}]
[null,"",0,"",0,"Aston Villa",null,null,"Everton",0,"",0,"",null,null,"",0,"",0,"Aston Villa",null,null,"Manchester City",0,"",0,""]
[null,"",0,"",0,"Brighton",null,null,"Southampton",0,"",0,"",null,null,"",0,"",0,"Chelsea",null,null,"Burnley",0,"",0,""]
[null,"",0,"",0,"Liverpool",null,null,"Arsenal",0,"",0,"",null,null,"",0,"",0,"Crystal Palace",null,null,"Arsenal",0,"",0,""]
[null,"",0,"",0,"Manchester United",null,null,"Crystal Palace",0,"",0,"",null,null,"",0,"",0,"Everton",null,null,"Brighton",0,"",0,""]
[null,"",0,"",0,"Norwich",null,null,"Chelsea",0,"",0,"",null,null,"",0,"",0,"Leicester City",null,null,"Southampton",0,"",0,""]
[null,"",0,"",0,"Sheffield United",null,null,"Leicester City",0,"",0,"",null,null,"",0,"",0,"Manchester United",null,null,"Norwich",0,"",0,""]
[null,"",0,"",0,"Tottenham",null,null,"Newcastle",0,"",0,"",null,null,"",0,"",0,"Sheffield United",null,null,"West Ham",0,"",0,""]
[null,"",0,"",0,"Watford",null,null,"West Ham",0,"",0,"",null,null,"",0,"",0,"Tottenham",null,null,"Liverpool",0,"",0,""]
[null,"",0,"",0,"Wolverhampton",null,null,"Burnley",0,"",0,"",null,null,"",0,"",0,"Wolverhampton",null,null,"Newcastle",0,"",0,""]
[]
[{"$nulls":5},"JOURNEE n°4",{"$nulls":13},"JOURNEE n°23"]
[{"$nulls":5},"SAMEDI 31 AOÛT 2019",{"$nulls":13},"SAMEDI 18 JANVIER 2020"]
[null,{"$f":"IF(AND(G46=\"\",H46=\"\"),\"\",IF(G46<H46,0,IF(H46<G46,3,IF(G46=H46,1,\"\"))))","v":""},{"$f":"IF(G46>H46,1,0)","v":0},{"$f":"IF(AND(G46=\"\",H46=\"\"),\"\",IF(G46=H46,1,0))","v":""},{"$f":"IF(G46<H46,1,0)","v":0},"Arsenal",null,null,"Tottenham",{"$f":"IF(G46<H46,1,0)","v":0},{"$f":"IF(AND(G46=\"\",H46=\"\"),\"\",IF(G46=H46,1,0))","v":""},{"$f":"IF(G46>H46,1,0)","v":0},{"$f":"IF(AND(G46=\"\",H46=\"\"),\"\",IF(G46>H46,0,IF(H46>G46,3,IF(G46=H46,1,\"\"))))","v":""},null,null,{"$f":"IF(AND(U46=\"\",V46=\"\"),\"\",IF(U46<V46,0,IF(V46<U46,3,IF(U46=V46,1,\"\"))))","v":""},{"$f":"IF(U46>V46,1,0)","v":0},{"$f":"IF(AND(U46=\"\",V46=\"\"),\"\",IF(U46=V46,1,0))","v":""},{"$f":"IF(U46<V46,1,0)","v":0},"Arsenal",null,null,"Sheffield United",{"$f":"IF(U46<V46,1,0)","v":0},{"$f":"IF(AND(U46=\"\",V46=\"\"),\"\",IF(U46=V46,1,0))","v":""},{"$f":"IF(U46>V46,1,0)","v":0},{"$f":"IF(AND(U46=\"\",V46=\"\"),\"\",IF(U46>V46,0,IF(V46>U46,3,IF(U46=V46,1,\"\"))))","v":""}]
[null,"",0,"",0,"Burnley",null,null,"Liverpool",0,"",0,"",null,null,"",0,"",0,"Brighton",null,null,"Aston Villa",0,"",0,""]
[null,"",0,"",0,"Chelsea",null,null,"Sheffield United",0,"",0,"",null,null,"",0,"",0,"Burnley",null,null,"Leicester City",0,"",0,""]
[null,"",0,"",0,"Crystal Palace",null,null,"Aston Villa",0,"",0,"",null,null,"",0,"",0,"Liverpool",null,null,"Manchester United",0,"",0,""]
[null,"",0,"",0,"Everton",null,null,"Wolverhampton",0,"",0,"",null,null,"",0,"",0,"Manchester City",null,null,"Crystal Palace",0,"",0,""]
[null,"",0,"",0,"Leicester City",null,null,"Bournemouth",0,"",0,"",null,null,"",0,"",0,"Newcastle",null,null,"Chelsea",0,"",0,""]
[null,"",0,"",0,"Manchester City",null,null,"Brighton",0,"",0,"",null,null,"",0,"",0,"Norwich",null,null,"Bournemouth",0,"",0,""]
[null,"",0,"",0,"Newcastle",null,null,"Watford",0,"",0,"",null,null,"",0,"",0,"Southampton",null,null,"Wolverhampton",0,"",0,""]
[null,"",0,"",0,"Southampton",null,null,"Manchester United",0,"",0,"",null,null,"",0,"",0,"Watford",null,null,"Tottenham",0,"",0,""]
[null,"",0,"",0,"West Ham",null,null,"Norwich",0,"",0,"",null,null,"",0,"",0,"West Ham",null,null,"Everton",0,"",0,""]
[]
[{"$nulls":5},"JOURNEE n°5",{"$nulls":13},"JOURNEE n°24"]
[{"$nulls":5},"SAMEDI 14 SEPTEMBRE 2019",{"$nulls":13},"MERCREDI 22 JANVIER 2020"]
[null,{"$f":"IF(AND(G59=\"\",H59=\"\"),\"\",IF(G59<H59,0,IF(H59<G59,3,IF(G59=H59,1,\"\"))))","v":""},{"$f":"IF(G59>H59,1,0)","v":0},{"$f":"IF(AND(G59=\"\",H59=\"\"),\"\",IF(G59=H59,1,0))","v":""},{"$f":"IF(G59<H59,1,0)","v":0},"Bournemouth",null,null,"Everton",{"$f":"IF(G59<H59,1,0)","v":0},{"$f":"IF(AND(G59=\"\",H59=\"\"),\"\",IF(G59=H59,1,0))","v":""},{"$f":"IF(G59>H59,1,0)","v":0},{"$f":"IF(AND(G59=\"\",H59=\"\"),\"\",IF(G59>H59,0,IF(H59>G59,3,IF(G59=H59,1,\"\"))))","v":""},null,null,{"$f":"IF(AND(U59=\"\",V59=\"\"),\"\",IF(U59<V59,0,IF(V59<U59,3,IF(U59=V59,1,\"\"))))","v":""},{"$f":"IF(U59>V59,1,0)","v":0},{"$f":"IF(AND(U59=\"\",V59=\"\"),\"\",IF(U59=V59,1,0))","v":""},{"$f":"IF(U59<V59,1,0)","v":0},"Bournemouth",null,null,"Brighton",{"$f":"IF(U59<V59,1,0)","v":0},{"$f":"IF(AND(U59=\"\",V59=\"\"),\"\",IF(U59=V59,1,0))","v":""},{"$f":"IF(U59>V59,1,0)","v":0},{"$f":"IF(AND(U59=\"\",V59=\"\"),\"\",IF(U59>V59,0,IF(V59>U59,3,IF(U59=V59,1,\"\"))))","v":""}]
[null,"",0,"",0,"Aston Villa",null,null,"West Ham",0,"",0,"",null,null,"",0,"",0,"Aston Villa",null,null,"Watford",0,"",0,""]
[null,"",0,"",0,"Brighton",null,null,"Burnley",0,"",0,"",null,null,"",0,"",0,"Everton",null,null,"Newcastle",0,"",0,""]
[null,"",0,"",0,"Liverpool",null,null,"Newcastle",0,"",0,"",null,null,"",0,"",0,"Leicester City",null,null,"West Ham",0,"",0,""]
[null,"",0,"",0,"Manchester United",null,null,"Leicester City",0,"",0,"",null,null,"",0,"",0,"Sheffield United",null,null,"Manchester City",0,"",0,""]
[null,"",0,"",0,"Norwich",null,null,"Manchester City",0,"",0,"",null,null,"",0,"",0,"Wolverhampton",null,null,"Liverpool",0,"",0,""]
[null,"",0,"",0,"Sheffield United",null,null,"Southampton",0,"",0,"",null,null,"",0,"",0,"Manchester United",null,null,"Burnley",0,"",0,""]
[null,"",0,"",0,"Tottenham",null,null,"Crystal Palace",0,"",0,"",null,null,"",0,"",0,"Chelsea",null,null,"Arsenal",0,"",0,""]
[null,"",0,"",0,"Watford",null,null,"Arsenal",0,"",0,"",null,null,"",0,"",0,"Tottenham",null,null,"Norwich",0,"",0,""]
[null,"",0,"",0,"Wolverhampton",null,null,"Chelsea",0,"",0,"",null,null,"",0,"",0,"Crystal Palace",null,null,"Southampton",0,"",0,""]
[]
[{"$nulls":5},"JOURNEE n°6",{"$nulls":13},"JOURNEE n°25"]
[{"$nulls":5},"SAMEDI 21 SEPTEMBRE 2019",{"$nulls":13},"SAMEDI 01 FÉVRIER 2020"]
[null,{"$f":"IF(AND(G72=\"\",H72=\"\"),\"\",IF(G72<H72,0,IF(H72<G72,3,IF(G72=H72,1,\"\"))))","v":""},{"$f":"IF(G72>H72,1,0)","v":0},{"$f":"IF(AND(G72=\"\",H72=\"\"),\"\",IF(G72=H72,1,0))","v":""},{"$f":"IF(G72<H72,1,0)","v":0},"Arsenal",null,null,"Aston Villa",{"$f":"IF(G72<H72,1,0)","v":0},{"$f":"IF(AND(G72=\"\",H72=\"\"),\"\",IF(G72=H72,1,0))","v":""},{"$f":"IF(G72>H72,1,0)","v":0},{"$f":"IF(AND(G72=\"\",H72=\"\"),\"\",IF(G72>H72,0,IF(H72>G72,3,IF(G72=H72,1,\"\"))))","v":""},null,null,{"$f":"IF(AND(U72=\"\",V72=\"\"),\"\",IF(U72<V72,0,IF(V72<U72,3,IF(U72=V72,1,\"\"))))","v":""},{"$f":"IF(U72>V72,1,0)","v":0},{"$f":"IF(AND(U72=\"\",V72=\"\"),\"\",IF(U72=V72,1,0))","v":""},{"$f":"IF(U72<V72,1,0)","v":0},"Bournemouth",null,null,"Aston Villa",{"$f":"IF(U72<V72,1,0)","v":0},{"$f":"IF(AND(U72=\"\",V72=\"\"),\"\",IF(U72=V72,1,0))","v":""},{"$f":"IF(U72>V72,1,0)","v":0},{"$f":"IF(AND(U72=\"\",V72=\"\"),\"\",IF(U72>V72,0,IF(V72>U72,3,IF(U72=V72,1,\"\"))))","v":""}]
[null,"",0,"",0,"Burnley",null,null,"Norwich",0,"",0,"",null,null,"",0,"",0,"Burnley",null,null,"Arsenal",0,"",0,""]
[null,"",0,"",0,"Chelsea",null,null,"Liverpool",0,"",0,"",null,null,"",0,"",0,"Crystal Palace",null,null,"Sheffield United",0,"",0,""]
[null,"",0,"",0,"Crystal Palace",null,null,"Wolverhampton",0,"",0,"",null,null,"",0,"",0,"Leicester City",null,null,"Chelsea",0,"",0,""]
[null,"",0,"",0,"Everton",null,null,"Sheffield United",0,"",0,"",null,null,"",0,"",0,"Liverpool",null,null,"Southampton",0,"",0,""]
[null,"",0,"",0,"Leicester City",null,null,"Tottenham",0,"",0,"",null,null,"",0,"",0,"Manchester United",null,null,"Wolverhampton",0,"",0,""]
[null,"",0,"",0,"Manchester City",null,null,"Watford",0,"",0,"",null,null,"",0,"",0,"Newcastle",null,null,"Norwich",0,"",0,""]
[null,"",0,"",0,"Newcastle",null,null,"Brighton",0,"",0,"",null,null,"",0,"",0,"Tottenham",null,null,"Manchester City",0,"",0,""]
[null,"",0,"",0,"Southampton",null,null,"Bournemouth",0,"",0,"",null,null,"",0,"",0,"Watford",null,null,"Everton",0,"",0,""]
[null,"",0,"",0,"West Ham",null,null,"Manchester United",0,"",0,"",null,null,"",0,"",0,"West Ham",null,null,"Brighton",0,"",0,""]
[]
[{"$nulls":5},"JOURNEE n°7",{"$nulls":13},"JOURNEE n°26"]
[{"$nulls":5},"SAMEDI 28 SEPTEMBRE 2019",{"$nulls":13},"SAMEDI 08 FÉVRIER 2020"]
[null,{"$f":"IF(AND(G85=\"\",H85=\"\"),\"\",IF(G85<H85,0,IF(H85<G85,3,IF(G85=H85,1,\"\"))))","v":""},{"$f":"IF(G85>H85,1,0)","v":0},{"$f":"IF(AND(G85=\"\",H85=\"\"),\"\",IF(G85=H85,1,0))","v":""},{"$f":"IF(G85<H85,1,0)","v":0},"Bournemouth",null,null,"West Ham",{"$f":"IF(G85<H85,1,0)","v":0},{"$f":"IF(AND(G85=\"\",H85=\"\"),\"\",IF(G85=H85,1,0))","v":""},{"$f":"IF(G85>H85,1,0)","v":0},{"$f":"IF(AND(G85=\"\",H85=\"\"),\"\",IF(G85>H85,0,IF(H85>G85,3,IF(G85=H85,1,\"\"))))","v":""},null,null,{"$f":"IF(AND(U85=\"\",V85=\"\"),\"\",IF(U85<V85,0,IF(V85<U85,3,IF(U85=V85,1,\"\"))))","v":""},{"$f":"IF(U85>V85,1,0)","v":0},{"$f":"IF(AND(U85=\"\",V85=\"\"),\"\",IF(U85=V85,1,0))","v":""},{"$f":"IF(U85<V85,1,0)","v":0},"Arsenal",null,null,"Newcastle",{"$f":"IF(U85<V85,1,0)","v":0},{"$f":"IF(AND(U85=\"\",V85=\"\"),\"\",IF(U85=V85,1,0))","v":""},{"$f":"IF(U85>V85,1,0)","v":0},{"$f":"IF(AND(U85=\"\",V85=\"\"),\"\",IF(U85>V85,0,IF(V85>U85,3,IF(U85=V85,1,\"\"))))","v":""}]
[null,"",0,"",0,"Aston Villa",null,null,"Burnley",0,"",0,"",null,null,"",0,"",0,"Aston Villa",null,null,"Tottenham",0,"",0,""]
[null,"",0,"",0,"Chelsea",null,null,"Brighton",0,"",0,"",null,null,"",0,"",0,"Brighton",null,null,"Watford",0,"",0,""]
[null,"",0,"",0,"Crystal Palace",null,null,"Norwich",0,"",0,"",null,null,"",0,"",0,"Chelsea",null,null,"Manchester United",0,"",0,""]
[null,"",0,"",0,"Everton",null,null,"Manchester City",0,"",0,"",null,null,"",0,"",0,"Everton",null,null,"Crystal Palace",0,"",0,""]
[null,"",0,"",0,"Leicester City",null,null,"Newcastle",0,"",0,"",null,null,"",0,"",0,"Manchester City",null,null,"West Ham",0,"",0,""]
[null,"",0,"",0,"Manchester United",null,null,"Arsenal",0,"",0,"",null,null,"",0,"",0,"Norwich",null,null,"Liverpool",0,"",0,""]
[null,"",0,"",0,"Sheffield United",null,null,"Liverpool",0,"",0,"",null,null,"",0,"",0,"Sheffield United",null,null,"Bournemouth",0,"",0,""]
[null,"",0,"",0,"Tottenham",null,null,"Southampton",0,"",0,"",null,null,"",0,"",0,"Southampton",null,null,"Burnley",0,"",0,""]
[null,"",0,"",0,"Wolverhampton",null,null,"Watford",0,"",0,"",null,null,"",0,"",0,"Wolverhampton",null,null,"Leicester City",0,"",0,""]
[]
[{"$nulls":5},"JOURNEE n°8",{"$nulls":13},"JOURNEE n°27"]
[{"$nulls":5},"SAMEDI 05 OCTOBRE 2019",{"$nulls":13},"SAMEDI 22 FÉVRIER 2020"]
[null,{"$f":"IF(AND(G98=\"\",H98=\"\"),\"\",IF(G98<H98,0,IF(H98<G98,3,IF(G98=H98,1,\"\"))))","v":""},{"$f":"IF(G98>H98,1,0)","v":0},{"$f":"IF(AND(G98=\"\",H98=\"\"),\"\",IF(G98=H98,1,0))","v":""},{"$f":"IF(G98<H98,1,0)","v":0},"Arsenal",null,null,"Bournemouth",{"$f":"IF(G98<H98,1,0)","v":0},{"$f":"IF(AND(G98=\"\",H98=\"\"),\"\",IF(G98=H98,1,0))","v":""},{"$f":"IF(G98>H98,1,0)","v":0},{"$f":"IF(AND(G98=\"\",H98=\"\"),\"\",IF(G98>H98,0,IF(H98>G98,3,IF(G98=H98,1,\"\"))))","v":""},null,null,{"$f":"IF(AND(U98=\"\",V98=\"\"),\"\",IF(U98<V98,0,IF(V98<U98,3,IF(U98=V98,1,\"\"))))","v":""},{"$f":"IF(U98>V98,1,0)","v":0},{"$f":"IF(AND(U98=\"\",V98=\"\"),\"\",IF(U98=V98,1,0))","v":""},{"$f":"IF(U98<V98,1,0)","v":0},"Arsenal",null,null,"Everton",{"$f":"IF(U98<V98,1,0)","v":0},{"$f":"IF(AND(U98=\"\",V98=\"\"),\"\",IF(U98=V98,1,0))","v":""},{"$f":"IF(U98>V98,1,0)","v":0},{"$f":"IF(AND(U98=\"\",V98=\"\"),\"\",IF(U98>V98,0,IF(V98>U98,3,IF(U98=V98,1,\"\"))))","v":""}]
[null,"",0,"",0,"Brighton",null,null,"Tottenham",0,"",0,"",null,null,"",0,"",0,"Burnley",null,null,"Bournemouth",0,"",0,""]
[null,"",0,"",0,"Burnley",null,null,"Everton",0,"",0,"",null,null,"",0,"",0,"Chelsea",null,null,"Tottenham",0,"",0,""]
[null,"",0,"",0,"Liverpool",null,null,"Leicester City",0,"",0,"",null,null,"",0,"",0,"Crystal Palace",null,null,"Newcastle",0,"",0,""]
[null,"",0,"",0,"Manchester City",null,null,"Wolverhampton",0,"",0,"",null,null,"",0,"",0,"Leicester City",null,null,"Manchester City",0,"",0,""]
[null,"",0,"",0,"Newcastle",null,null,"Manchester United",0,"",0,"",null,null,"",0,"",0,"Liverpool",null,null,"West Ham",0,"",0,""]
[null,"",0,"",0,"Norwich",null,null,"Aston Villa",0,"",0,"",null,null,"",0,"",0,"Manchester United",null,null,"Watford",0,"",0,""]
[null,"",0,"",0,"Southampton",null,null,"Chelsea",0,"",0,"",null,null,"",0,"",0,"Sheffield United",null,null,"Brighton",0,"",0,""]
[null,"",0,"",0,"Watford",null,null,"Sheffield United",0,"",0,"",null,null,"",0,"",0,"Southampton",null,null,"Aston Villa",0,"",0,""]
[null,"",0,"",0,"West Ham",null,null,"Crystal Palace",0,"",0,"",null,null,"",0,"",0,"Wolverhampton",null,null,"Norwich",0,"",0,""]
[]
[{"$nulls":5},"JOURNEE n°9",{"$nulls":13},"JOURNEE n°28"]
[{"$nulls":5},"SAMEDI 19 OCTOBRE 2019",{"$nulls":13},"SAMEDI 29 FÉVRIER 2020"]
[null,{"$f":"IF(AND(G111=\"\",H111=\"\"),\"\",IF(G111<H111,0,IF(H111<G111,3,IF(G111=H111,1,\"\"))))","v":""},{"$f":"IF(G111>H111,1,0)","v":0},{"$f":"IF(AND(G111=\"\",H111=\"\"),\"\",IF(G111=H111,1,0))","v":""},{"$f":"IF(G111<H111,1,0)","v":0},"Bournemouth",null,null,"Norwich",{"$f":"IF(G111<H111,1,0)","v":0},{"$f":"IF(AND(G111=\"\",H111=\"\"),\"\",IF(G111=H111,1,0))","v":""},{"$f":"IF(G111>H111,1,0)","v":0},{"$f":"IF(AND(G111=\"\",H111=\"\"),\"\",IF(G111>H111,0,IF(H111>G111,3,IF(G111=H111,1,\"\"))))","v":""},null,null,{"$f":"IF(AND(U111=\"\",V111=\"\"),\"\",IF(U111<V111,0,IF(V111<U111,3,IF(U111=V111,1,\"\"))))","v":""},{"$f":"IF(U111>V111,1,0)","v":0},{"$f":"IF(AND(U111=\"\",V111=\"\"),\"\",IF(U111=V111,1,0))","v":""},{"$f":"IF(U111<V111,1,0)","v":0},"Bournemouth",null,null,"Chelsea",{"$f":"IF(U111<V111,1,0)","v":0},{"$f":"IF(AND(U111=\"\",V111=\"\"),\"\",IF(U111=V111,1,0))","v":""},{"$f":"IF(U111>V111,1,0)","v":0},{"$f":"IF(AND(U111=\"\",V111=\"\"),\"\",IF(U111>V111,0,IF(V111>U111,3,IF(U111=V111,1,\"\"))))","v":""}]
[null,"",0,"",0,"Aston Villa",null,null,"Brighton",0,"",0,"",null,null,"",0,"",0,"Aston Villa",null,null,"Sheffield United",0,"",0,""]
[null,"",0,"",0,"Chelsea",null,null,"Newcastle",0,"",0,"",null,null,"",0,"",0,"Brighton",null,null,"Crystal Palace",0,"",0,""]
[null,"",0,"",0,"Crystal Palace",null,null,"Manchester City",0,"",0,"",null,null,"",0,"",0,"Everton",null,null,"Manchester United",0,"",0,""]
[null,"",0,"",0,"Everton",null,null,"West Ham",0,"",0,"",null,null,"",0,"",0,"Manchester City",null,null,"Arsenal",0,"",0,""]
[null,"",0,"",0,"Leicester City",null,null,"Burnley",0,"",0,"",null,null,"",0,"",0,"Newcastle",null,null,"Burnley",0,"",0,""]
[null,"",0,"",0,"Manchester United",null,null,"Liverpool",0,"",0,"",null,null,"",0,"",0,"Norwich",null,null,"Leicester City",0,"",0,""]
[null,"",0,"",0,"Sheffield United",null,null,"Arsenal",0,"",0,"",null,null,"",0,"",0,"Tottenham",null,null,"Wolverhampton",0,"",0,""]
[null,"",0,"",0,"Tottenham",null,null,"Watford",0,"",0,"",null,null,"",0,"",0,"Watford",null,null,"Liverpool",0,"",0,""]
[null,"",0,"",0,"Wolverhampton",null,null,"Southampton",0,"",0,"",null,null,"",0,"",0,"West Ham",null,null,"Southampton",0,"",0,""]
[]
[{"$nulls":5},"JOURNEE n°10",{"$nulls":13},"JOURNEE n°29"]
[{"$nulls":5},"SAMEDI 26 OCTOBRE 2019",{"$nulls":13},"SAMEDI 07 MARS 2020"]
[null,{"$f":"IF(AND(G124=\"\",H124=\"\"),\"\",IF(G124<H124,0,IF(H124<G124,3,IF(G124=H124,1,\"\"))))","v":""},{"$f":"IF(G124>H124,1,0)","v":0},{"$f":"IF(AND(G124=\"\",H124=\"\"),\"\",IF(G124=H124,1,0))","v":""},{"$f":"IF(G124<H124,1,0)","v":0},"Arsenal",null,null,"Crystal Palace",{"$f":"IF(G124<H124,1,0)","v":0},{"$f":"IF(AND(G124=\"\",H124=\"\"),\"\",IF(G124=H124,1,0))","v":""},{"$f":"IF(G124>H124,1,0)","v":0},{"$f":"IF(AND(G124=\"\",H124=\"\"),\"\",IF(G124>H124,0,IF(H124>G124,3,IF(G124=H124,1,\"\"))))","v":""},null,null,{"$f":"IF(AND(U124=\"\",V124=\"\"),\"\",IF(U124<V124,0,IF(V124<U124,3,IF(U124=V124,1,\"\"))))","v":""},{"$f":"IF(U124>V124,1,0)","v":0},{"$f":"IF(AND(U124=\"\",V124=\"\"),\"\",IF(U124=V124,1,0))","v":""},{"$f":"IF(U124<V124,1,0)","v":0},"Arsenal",null,null,"West Ham",{"$f":"IF(U124<V124,1,0)","v":0},{"$f":"IF(AND(U124=\"\",V124=\"\"),\"\",IF(U124=V124,1,0))","v":""},{"$f":"IF(U124>V124,1,0)","v":0},{"$f":"IF(AND(U124=\"\",V124=\"\"),\"\",IF(U124>V124,0,IF(V124>U124,3,IF(U124=V124,1,\"\"))))","v":""}]
[null,"",0,"",0,"Brighton",null,null,"Everton",0,"",0,"",null,null,"",0,"",0,"Burnley",null,null,"Tottenham",0,"",0,""]
[null,"",0,"",0,"Burnley",null,null,"Chelsea",0,"",0,"",null,null,"",0,"",0,"Chelsea",null,null,"Everton",0,"",0,""]
[null,"",0,"",0,"Liverpool",null,null,"Tottenham",0,"",0,"",null,null,"",0,"",0,"Crystal Palace",null,null,"Watford",0,"",0,""]
[null,"",0,"",0,"Manchester City",null,null,"Aston Villa",0,"",0,"",null,null,"",0,"",0,"Leicester City",null,null,"Aston Villa",0,"",0,""]
[null,"",0,"",0,"Newcastle",null,null,"Wolverhampton",0,"",0,"",null,null,"",0,"",0,"Liverpool",null,null,"Bournemouth",0,"",0,""]
[null,"",0,"",0,"Norwich",null,null,"Manchester United",0,"",0,"",null,null,"",0,"",0,"Manchester United",null,null,"Manchester City",0,"",0,""]
[null,"",0,"",0,"Southampton",null,null,"Leicester City",0,"",0,"",null,null,"",0,"",0,"Sheffield United",null,null,"Norwich",0,"",0,""]
[null,"",0,"",0,"Watford",null,null,"Bournemouth",0,"",0,"",null,null,"",0,"",0,"Southampton",null,null,"Newcastle",0,"",0,""]
[null,"",0,"",0,"West Ham",null,null,"Sheffield United",0,"",0,"",null,null,"",0,"",0,"Wolverhampton",null,null,"Brighton",0,"",0,""]
[]
[{"$nulls":5},"JOURNEE n°11",{"$nulls":13},"JOURNEE n°30"]
[{"$nulls":5},"SAMEDI 02 NOVEMBRE 2019",{"$nulls":13},"SAMEDI 14 MARS 2020"]
[null,{"$f":"IF(AND(G137=\"\",H137=\"\"),\"\",IF(G137<H137,0,IF(H137<G137,3,IF(G137=H137,1,\"\"))))","v":""},{"$f":"IF(G137>H137,1,0)","v":0},{"$f":"IF(AND(G137=\"\",H137=\"\"),\"\",IF(G137=H137,1,0))","v":""},{"$f":"IF(G137<H137,1,0)","v":0},"Bournemouth",null,null,"Manchester United",{"$f":"IF(G137<H137,1,0)","v":0},{"$f":"IF(AND(G137=\"\",H137=\"\"),\"\",IF(G137=H137,1,0))","v":""},{"$f":"IF(G137>H137,1,0)","v":0},{"$f":"IF(AND(G137=\"\",H137=\"\"),\"\",IF(G137>H137,0,IF(H137>G137,3,IF(G137=H137,1,\"\"))))","v":""},null,null,{"$f":"IF(AND(U137=\"\",V137=\"\"),\"\",IF(U137<V137,0,IF(V137<U137,3,IF(U137=V137,1,\"\"))))","v":""},{"$f":"IF(U137>V137,1,0)","v":0},{"$f":"IF(AND(U137=\"\",V137=\"\"),\"\",IF(U137=V137,1,0))","v":""},{"$f":"IF(U137<V137,1,0)","v":0},"Bournemouth",null,null,"Crystal Palace",{"$f":"IF(U137<V137,1,0)","v":0},{"$f":"IF(AND(U137=\"\",V137=\"\"),\"\",IF(U137=V137,1,0))","v":""},{"$f":"IF(U137>V137,1,0)","v":0},{"$f":"IF(AND(U137=\"\",V137=\"\"),\"\",IF(U137>V137,0,IF(V137>U137,3,IF(U137=V137,1,\"\"))))","v":""}]
[null,"",0,"",0,"Arsenal",null,null,"Wolverhampton",0,"",0,"",null,null,"",0,"",0,"Aston Villa",null,null,"Chelsea",0,"",0,""]
[null,"",0,"",0,"Aston Villa",null,null,"Liverpool",0,"",0,"",null,null,"",0,"",0,"Brighton",null,null,"Arsenal",0,"",0,""]
[null,"",0,"",0,"Brighton",null,null,"Norwich",0,"",0,"",null,null,"",0,"",0,"Everton",null,null,"Liverpool",0,"",0,""]
[null,"",0,"",0,"Crystal Palace",null,null,"Leicester City",0,"",0,"",null,null,"",0,"",0,"Manchester City",null,null,"Burnley",0,"",0,""]
[null,"",0,"",0,"Everton",null,null,"Tottenham",0,"",0,"",null,null,"",0,"",0,"Newcastle",null,null,"Sheffield United",0,"",0,""]
[null,"",0,"",0,"Manchester City",null,null,"Southampton",0,"",0,"",null,null,"",0,"",0,"Norwich",null,null,"Southampton",0,"",0,""]
[null,"",0,"",0,"Sheffield United",null,null,"Burnley",0,"",0,"",null,null,"",0,"",0,"Tottenham",null,null,"Manchester United",0,"",0,""]
[null,"",0,"",0,"Watford",null,null,"Chelsea",0,"",0,"",null,null,"",0,"",0,"Watford",null,null,"Leicester City",0,"",0,""]
[null,"",0,"",0,"West Ham",null,null,"Newcastle",0,"",0,"",null,null,"",0,"",0,"West Ham",null,null,"Wolverhampton",0,"",0,""]
[]
[{"$nulls":5},"JOURNEE n°12",{"$nulls":13},"JOURNEE n°31"]
[{"$nulls":5},"SAMEDI 09 NOVEMBRE 2019",{"$nulls":13},"SAMEDI 21 MARS 2020"]
[null,{"$f":"IF(AND(G150=\"\",H150=\"\"),\"\",IF(G150<H150,0,IF(H150<G150,3,IF(G150=H150,1,\"\"))))","v":""},{"$f":"IF(G150>H150,1,0)","v":0},{"$f":"IF(AND(G150=\"\",H150=\"\"),\"\",IF(G150=H150,1,0))","v":""},{"$f":"IF(G150<H150,1,0)","v":0},"Burnley",null,null,"West Ham",{"$f":"IF(G150<H150,1,0)","v":0},{"$f":"IF(AND(G150=\"\",H150=\"\"),\"\",IF(G150=H150,1,0))","v":""},{"$f":"IF(G150>H150,1,0)","v":0},{"$f":"IF(AND(G150=\"\",H150=\"\"),\"\",IF(G150>H150,0,IF(H150>G150,3,IF(G150=H150,1,\"\"))))","v":""},null,null,{"$f":"IF(AND(U150=\"\",V150=\"\"),\"\",IF(U150<V150,0,IF(V150<U150,3,IF(U150=V150,1,\"\"))))","v":""},{"$f":"IF(U150>V150,1,0)","v":0},{"$f":"IF(AND(U150=\"\",V150=\"\"),\"\",IF(U150=V150,1,0))","v":""},{"$f":"IF(U150<V150,1,0)","v":0},"Burnley",null,null,"Watford",{"$f":"IF(U150<V150,1,0)","v":0},{"$f":"IF(AND(U150=\"\",V150=\"\"),\"\",IF(U150=V150,1,0))","v":""},{"$f":"IF(U150>V150,1,0)","v":0},{"$f":"IF(AND(U150=\"\",V150=\"\"),\"\",IF(U150>V150,0,IF(V150>U150,3,IF(U150=V150,1,\"\"))))","v":""}]
[null,"",0,"",0,"Chelsea",null,null,"Crystal Palace",0,"",0,"",null,null,"",0,"",0,"Chelsea",null,null,"Manchester City",0,"",0,""]
[null,"",0,"",0,"Leicester City",null,null,"Arsenal",0,"",0,"",null,null,"",0,"",0,"Leicester City",null,null,"Brighton",0,"",0,""]
[null,"",0,"",0,"Liverpool",null,null,"Manchester City",0,"",0,"",null,null,"",0,"",0,"Liverpool",null,null,"Crystal Palace",0,"",0,""]
[null,"",0,"",0,"Manchester United",null,null,"Brighton",0,"",0,"",null,null,"",0,"",0,"Manchester United",null,null,"Sheffield United",0,"",0,""]
[null,"",0,"",0,"Newcastle",null,null,"Bournemouth",0,"",0,"",null,null,"",0,"",0,"Newcastle",null,null,"Aston Villa",0,"",0,""]
[null,"",0,"",0,"Norwich",null,null,"Watford",0,"",0,"",null,null,"",0,"",0,"Norwich",null,null,"Everton",0,"",0,""]
[null,"",0,"",0,"Southampton",null,null,"Everton",0,"",0,"",null,null,"",0,"",0,"Southampton",null,null,"Arsenal",0,"",0,""]
[null,"",0,"",0,"Tottenham",null,null,"Sheffield United",0,"",0,"",null,null,"",0,"",0,"Tottenham",null,null,"West Ham",0,"",0,""]
[null,"",0,"",0,"Wolverhampton",null,null,"Aston Villa",0,"",0,"",null,null,"",0,"",0,"Wolverhampton",null,null,"Bournemouth",0,"",0,""]
[]
[{"$nulls":5},"JOURNEE n°13",{"$nulls":13},"JOURNEE n°32"]
[{"$nulls":5},"SAMEDI 23 NOVEMBRE 2019",{"$nulls":13},"SAMEDI 04 AVRIL 2020"]
[null,{"$f":"IF(AND(G163=\"\",H163=\"\"),\"\",IF(G163<H163,0,IF(H163<G163,3,IF(G163=H163,1,\"\"))))","v":""},{"$f":"IF(G163>H163,1,0)","v":0},{"$f":"IF(AND(G163=\"\",H163=\"\"),\"\",IF(G163=H163,1,0))","v":""},{"$f":"IF(G163<H163,1,0)","v":0},"Bournemouth",null,null,"Wolverhampton",{"$f":"IF(G163<H163,1,0)","v":0},{"$f":"IF(AND(G163=\"\",H163=\"\"),\"\",IF(G163=H163,1,0))","v":""},{"$f":"IF(G163>H163,1,0)","v":0},{"$f":"IF(AND(G163=\"\",H163=\"\"),\"\",IF(G163>H163,0,IF(H163>G163,3,IF(G163=H163,1,\"\"))))","v":""},null,null,{"$f":"IF(AND(U163=\"\",V163=\"\"),\"\",IF(U163<V163,0,IF(V163<U163,3,IF(U163=V163,1,\"\"))))","v":""},{"$f":"IF(U163>V163,1,0)","v":0},{"$f":"IF(AND(U163=\"\",V163=\"\"),\"\",IF(U163=V163,1,0))","v":""},{"$f":"IF(U163<V163,1,0)","v":0},"Bournemouth",null,null,"Newcastle",{"$f":"IF(U163<V163,1,0)","v":0},{"$f":"IF(AND(U163=\"\",V163=\"\"),\"\",IF(U163=V163,1,0))","v":""},{"$f":"IF(U163>V163,1,0)","v":0},{"$f":"IF(AND(U163=\"\",V163=\"\"),\"\",IF(U163>V163,0,IF(V163>U163,3,IF(U163=V163,1,\"\"))))","v":""}]
[null,"",0,"",0,"Arsenal",null,null,"Southampton",0,"",0,"",null,null,"",0,"",0,"Arsenal",null,null,"Norwich",0,"",0,""]
[null,"",0,"",0,"Aston Villa",null,null,"Newcastle",0,"",0,"",null,null,"",0,"",0,"Aston Villa",null,null,"Wolverhampton",0,"",0,""]
[null,"",0,"",0,"Brighton",null,null,"Leicester City",0,"",0,"",null,null,"",0,"",0,"Brighton",null,null,"Manchester United",0,"",0,""]
[null,"",0,"",0,"Crystal Palace",null,null,"Liverpool",0,"",0,"",null,null,"",0,"",0,"Crystal Palace",null,null,"Burnley",0,"",0,""]
[null,"",0,"",0,"Everton",null,null,"Norwich",0,"",0,"",null,null,"",0,"",0,"Everton",null,null,"Leicester City",0,"",0,""]
[null,"",0,"",0,"Manchester City",null,null,"Chelsea",0,"",0,"",null,null,"",0,"",0,"Manchester City",null,null,"Liverpool",0,"",0,""]
[null,"",0,"",0,"Sheffield United",null,null,"Manchester United",0,"",0,"",null,null,"",0,"",0,"Sheffield United",null,null,"Tottenham",0,"",0,""]
[null,"",0,"",0,"Watford",null,null,"Burnley",0,"",0,"",null,null,"",0,"",0,"Watford",null,null,"Southampton",0,"",0,""]
[null,"",0,"",0,"West Ham",null,null,"Tottenham",0,"",0,"",null,null,"",0,"",0,"West Ham",null,null,"Chelsea",0,"",0,""]
[]
[{"$nulls":5},"JOURNEE n°14",{"$nulls":13},"JOURNEE n°33"]
[{"$nulls":5},"SAMEDI 30 NOVEMBRE 2019",{"$nulls":13},"SAMEDI 11 AVRIL 2020"]
[null,{"$f":"IF(AND(G176=\"\",H176=\"\"),\"\",IF(G176<H176,0,IF(H176<G176,3,IF(G176=H176,1,\"\"))))","v":""},{"$f":"IF(G176>H176,1,0)","v":0},{"$f":"IF(AND(G176=\"\",H176=\"\"),\"\",IF(G176=H176,1,0))","v":""},{"$f":"IF(G176<H176,1,0)","v":0},"Burnley",null,null,"Crystal Palace",{"$f":"IF(G176<H176,1,0)","v":0},{"$f":"IF(AND(G176=\"\",H176=\"\"),\"\",IF(G176=H176,1,0))","v":""},{"$f":"IF(G176>H176,1,0)","v":0},{"$f":"IF(AND(G176=\"\",H176=\"\"),\"\",IF(G176>H176,0,IF(H176>G176,3,IF(G176=H176,1,\"\"))))","v":""},null,null,{"$f":"IF(AND(U176=\"\",V176=\"\"),\"\",IF(U176<V176,0,IF(V176<U176,3,IF(U176=V176,1,\"\"))))","v":""},{"$f":"IF(U176>V176,1,0)","v":0},{"$f":"IF(AND(U176=\"\",V176=\"\"),\"\",IF(U176=V176,1,0))","v":""},{"$f":"IF(U176<V176,1,0)","v":0},"Burnley",null,null,"Sheffield United",{"$f":"IF(U176<V176,1,0)","v":0},{"$f":"IF(AND(U176=\"\",V176=\"\"),\"\",IF(U176=V176,1,0))","v":""},{"$f":"IF(U176>V176,1,0)","v":0},{"$f":"IF(AND(U176=\"\",V176=\"\"),\"\",IF(U176>V176,0,IF(V176>U176,3,IF(U176=V176,1,\"\"))))","v":""}]
[null,"",0,"",0,"Chelsea",null,null,"West Ham",0,"",0,"",null,null,"",0,"",0,"Chelsea",null,null,"Watford",0,"",0,""]
[null,"",0,"",0,"Leicester City",null,null,"Everton",0,"",0,"",null,null,"",0,"",0,"Leicester City",null,null,"Crystal Palace",0,"",0,""]
[null,"",0,"",0,"Liverpool",null,null,"Brighton",0,"",0,"",null,null,"",0,"",0,"Liverpool",null,null,"Aston Villa",0,"",0,""]
[null,"",0,"",0,"Manchester United",null,null,"Aston Villa",0,"",0,"",null,null,"",0,"",0,"Manchester United",null,null,"Bournemouth",0,"",0,""]
[null,"",0,"",0,"Newcastle",null,null,"Manchester City",0,"",0,"",null,null,"",0,"",0,"Newcastle",null,null,"West Ham",0,"",0,""]
[null,"",0,"",0,"Norwich",null,null,"Arsenal",0,"",0,"",null,null,"",0,"",0,"Norwich",null,null,"Brighton",0,"",0,""]
[null,"",0,"",0,"Southampton",null,null,"Watford",0,"",0,"",null,null,"",0,"",0,"Southampton",null,null,"Manchester City",0,"",0,""]
[null,"",0,"",0,"Tottenham",null,null,"Bournemouth",0,"",0,"",null,null,"",0,"",0,"Tottenham",null,null,"Everton",0,"",0,""]
[null,"",0,"",0,"Wolverhampton",null,null,"Sheffield United",0,"",0,"",null,null,"",0,"",0,"Wolverhampton",null,null,"Arsenal",0,"",0,""]
[]
[{"$nulls":5},"JOURNEE n°15",{"$nulls":13},"JOURNEE n°34"]
[{"$nulls":5},"MERCREDI 04 DÉCEMBRE 2019",{"$nulls":13},"SAMEDI 18 AVRIL 2020"]
[null,{"$f":"IF(AND(G189=\"\",H189=\"\"),\"\",IF(G189<H189,0,IF(H189<G189,3,IF(G189=H189,1,\"\"))))","v":""},{"$f":"IF(G189>H189,1,0)","v":0},{"$f":"IF(AND(G189=\"\",H189=\"\"),\"\",IF(G189=H189,1,0))","v":""},{"$f":"IF(G189<H189,1,0)","v":0},"Arsenal",null,null,"Brighton",{"$f":"IF(G189<H189,1,0)","v":0},{"$f":"IF(AND(G189=\"\",H189=\"\"),\"\",IF(G189=H189,1,0))","v":""},{"$f":"IF(G189>H189,1,0)","v":0},{"$f":"IF(AND(G189=\"\",H189=\"\"),\"\",IF(G189>H189,0,IF(H189>G189,3,IF(G189=H189,1,\"\"))))","v":""},null,null,{"$f":"IF(AND(U189=\"\",V189=\"\"),\"\",IF(U189<V189,0,IF(V189<U189,3,IF(U189=V189,1,\"\"))))","v":""},{"$f":"IF(U189>V189,1,0)","v":0},{"$f":"IF(AND(U189=\"\",V189=\"\"),\"\",IF(U189=V189,1,0))","v":""},{"$f":"IF(U189<V189,1,0)","v":0},"Bournemouth",null,null,"Tottenham",{"$f":"IF(U189<V189,1,0)","v":0},{"$f":"IF(AND(U189=\"\",V189=\"\"),\"\",IF(U189=V189,1,0))","v":""},{"$f":"IF(U189>V189,1,0)","v":0},{"$f":"IF(AND(U189=\"\",V189=\"\"),\"\",IF(U189>V189,0,IF(V189>U189,3,IF(U189=V189,1,\"\"))))","v":""}]
[null,"",0,"",0,"Burnley",null,null,"Manchester City",0,"",0,"",null,null,"",0,"",0,"Arsenal",null,null,"Leicester City",0,"",0,""]
[null,"",0,"",0,"Leicester City",null,null,"Watford",0,"",0,"",null,null,"",0,"",0,"Aston Villa",null,null,"Manchester United",0,"",0,""]
[null,"",0,"",0,"Sheffield United",null,null,"Newcastle",0,"",0,"",null,null,"",0,"",0,"Brighton",null,null,"Liverpool",0,"",0,""]
[null,"",0,"",0,"Wolverhampton",null,null,"West Ham",0,"",0,"",null,null,"",0,"",0,"Crystal Palace",null,null,"Chelsea",0,"",0,""]
[null,"",0,"",0,"Manchester United",null,null,"Tottenham",0,"",0,"",null,null,"",0,"",0,"Everton",null,null,"Southampton",0,"",0,""]
[null,"",0,"",0,"Chelsea",null,null,"Aston Villa",0,"",0,"",null,null,"",0,"",0,"Manchester City",null,null,"Newcastle",0,"",0,""]
[null,"",0,"",0,"Southampton",null,null,"Norwich",0,"",0,"",null,null,"",0,"",0,"Sheffield United",null,null,"Wolverhampton",0,"",0,""]
[null,"",0,"",0,"Crystal Palace",null,null,"Bournemouth",0,"",0,"",null,null,"",0,"",0,"Watford",null,null,"Norwich",0,"",0,""]
[null,"",0,"",0,"Liverpool",null,null,"Everton",0,"",0,"",null,null,"",0,"",0,"West Ham",null,null,"Burnley",0,"",0,""]
[]
[{"$nulls":5},"JOURNEE n°16",{"$nulls":13},"JOURNEE n°35"]
[{"$nulls":5},"SAMEDI 07 DÉCEMBRE 2019",{"$nulls":13},"SAMEDI 25 AVRIL 2020"]
[null,{"$f":"IF(AND(G202=\"\",H202=\"\"),\"\",IF(G202<H202,0,IF(H202<G202,3,IF(G202=H202,1,\"\"))))","v":""},{"$f":"IF(G202>H202,1,0)","v":0},{"$f":"IF(AND(G202=\"\",H202=\"\"),\"\",IF(G202=H202,1,0))","v":""},{"$f":"IF(G202<H202,1,0)","v":0},"Bournemouth",null,null,"Liverpool",{"$f":"IF(G202<H202,1,0)","v":0},{"$f":"IF(AND(G202=\"\",H202=\"\"),\"\",IF(G202=H202,1,0))","v":""},{"$f":"IF(G202>H202,1,0)","v":0},{"$f":"IF(AND(G202=\"\",H202=\"\"),\"\",IF(G202>H202,0,IF(H202>G202,3,IF(G202=H202,1,\"\"))))","v":""},null,null,{"$f":"IF(AND(U202=\"\",V202=\"\"),\"\",IF(U202<V202,0,IF(V202<U202,3,IF(U202=V202,1,\"\"))))","v":""},{"$f":"IF(U202>V202,1,0)","v":0},{"$f":"IF(AND(U202=\"\",V202=\"\"),\"\",IF(U202=V202,1,0))","v":""},{"$f":"IF(U202<V202,1,0)","v":0},"Bournemouth",null,null,"Leicester City",{"$f":"IF(U202<V202,1,0)","v":0},{"$f":"IF(AND(U202=\"\",V202=\"\"),\"\",IF(U202=V202,1,0))","v":""},{"$f":"IF(U202>V202,1,0)","v":0},{"$f":"IF(AND(U202=\"\",V202=\"\"),\"\",IF(U202>V202,0,IF(V202>U202,3,IF(U202=V202,1,\"\"))))","v":""}]
[null,"",0,"",0,"Aston Villa",null,null,"Leicester City",0,"",0,"",null,null,"",0,"",0,"Aston Villa",null,null,"Crystal Palace",0,"",0,""]
[null,"",0,"",0,"Brighton",null,null,"Wolverhampton",0,"",0,"",null,null,"",0,"",0,"Brighton",null,null,"Manchester City",0,"",0,""]
[null,"",0,"",0,"Everton",null,null,"Chelsea",0,"",0,"",null,null,"",0,"",0,"Liverpool",null,null,"Burnley",0,"",0,""]
[null,"",0,"",0,"Manchester City",null,null,"Manchester United",0,"",0,"",null,null,"",0,"",0,"Manchester United",null,null,"Southampton",0,"",0,""]
[null,"",0,"",0,"Newcastle",null,null,"Southampton",0,"",0,"",null,null,"",0,"",0,"Norwich",null,null,"West Ham",0,"",0,""]
[null,"",0,"",0,"Norwich",null,null,"Sheffield United",0,"",0,"",null,null,"",0,"",0,"Sheffield United",null,null,"Chelsea",0,"",0,""]
[null,"",0,"",0,"Tottenham",null,null,"Burnley",0,"",0,"",null,null,"",0,"",0,"Tottenham",null,null,"Arsenal",0,"",0,""]
[null,"",0,"",0,"Watford",null,null,"Crystal Palace",0,"",0,"",null,null,"",0,"",0,"Watford",null,null,"Newcastle",0,"",0,""]
[null,"",0,"",0,"West Ham",null,null,"Arsenal",0,"",0,"",null,null,"",0,"",0,"Wolverhampton",null,null,"Everton",0,"",0,""]
[]
[{"$nulls":5},"JOURNEE n°17",{"$nulls":13},"JOURNEE n°36"]
[{"$nulls":5},"SAMEDI 14 DÉCEMBRE 2019",{"$nulls":13},"SAMEDI 09 MAI 2020"]
[null,{"$f":"IF(AND(G215=\"\",H215=\"\"),\"\",IF(G215<H215,0,IF(H215<G215,3,IF(G215=H215,1,\"\"))))","v":""},{"$f":"IF(G215>H215,1,0)","v":0},{"$f":"IF(AND(G215=\"\",H215=\"\"),\"\",IF(G215=H215,1,0))","v":""},{"$f":"IF(G215<H215,1,0)","v":0},"Arsenal",null,null,"Manchester City",{"$f":"IF(G215<H215,1,0)","v":0},{"$f":"IF(AND(G215=\"\",H215=\"\"),\"\",IF(G215=H215,1,0))","v":""},{"$f":"IF(G215>H215,1,0)","v":0},{"$f":"IF(AND(G215=\"\",H215=\"\"),\"\",IF(G215>H215,0,IF(H215>G215,3,IF(G215=H215,1,\"\"))))","v":""},null,null,{"$f":"IF(AND(U215=\"\",V215=\"\"),\"\",IF(U215<V215,0,IF(V215<U215,3,IF(U215=V215,1,\"\"))))","v":""},{"$f":"IF(U215>V215,1,0)","v":0},{"$f":"IF(AND(U215=\"\",V215=\"\"),\"\",IF(U215=V215,1,0))","v":""},{"$f":"IF(U215<V215,1,0)","v":0},"Arsenal",null,null,"Liverpool",{"$f":"IF(U215<V215,1,0)","v":0},{"$f":"IF(AND(U215=\"\",V215=\"\"),\"\",IF(U215=V215,1,0))","v":""},{"$f":"IF(U215>V215,1,0)","v":0},{"$f":"IF(AND(U215=\"\",V215=\"\"),\"\",IF(U215>V215,0,IF(V215>U215,3,IF(U215=V215,1,\"\"))))","v":""}]
[null,"",0,"",0,"Burnley",null,null,"Newcastle",0,"",0,"",null,null,"",0,"",0,"Burnley",null,null,"Wolverhampton",0,"",0,""]
[null,"",0,"",0,"Chelsea",null,null,"Bournemouth",0,"",0,"",null,null,"",0,"",0,"Chelsea",null,null,"Norwich",0,"",0,""]
[null,"",0,"",0,"Crystal Palace",null,null,"Brighton",0,"",0,"",null,null,"",0,"",0,"Crystal Palace",null,null,"Manchester United",0,"",0,""]
[null,"",0,"",0,"Leicester City",null,null,"Norwich",0,"",0,"",null,null,"",0,"",0,"Everton",null,null,"Aston Villa",0,"",0,""]
[null,"",0,"",0,"Liverpool",null,null,"Watford",0,"",0,"",null,null,"",0,"",0,"Leicester City",null,null,"Sheffield United",0,"",0,""]
[null,"",0,"",0,"Manchester United",null,null,"Everton",0,"",0,"",null,null,"",0,"",0,"Manchester City",null,null,"Bournemouth",0,"",0,""]
[null,"",0,"",0,"Sheffield United",null,null,"Aston Villa",0,"",0,"",null,null,"",0,"",0,"Newcastle",null,null,"Tottenham",0,"",0,""]
[null,"",0,"",0,"Southampton",null,null,"West Ham",0,"",0,"",null,null,"",0,"",0,"Southampton",null,null,"Brighton",0,"",0,""]
[null,"",0,"",0,"Wolverhampton",null,null,"Tottenham",0,"",0,"",null,null,"",0,"",0,"West Ham",null,null,"Watford",0,"",0,""]
[]
[{"$nulls":5},"JOURNEE n°18",{"$nulls":13},"JOURNEE n°37"]
[{"$nulls":5},"SAMEDI 21 DÉCEMBRE 2019",{"$nulls":13},"DIMANCHE 17 MAI 2020"]
[null,{"$f":"IF(AND(G228=\"\",H228=\"\"),\"\",IF(G228<H228,0,IF(H228<G228,3,IF(G228=H228,1,\"\"))))","v":""},{"$f":"IF(G228>H228,1,0)","v":0},{"$f":"IF(AND(G228=\"\",H228=\"\"),\"\",IF(G228=H228,1,0))","v":""},{"$f":"IF(G228<H228,1,0)","v":0},"Bournemouth",null,null,"Burnley",{"$f":"IF(G228<H228,1,0)","v":0},{"$f":"IF(AND(G228=\"\",H228=\"\"),\"\",IF(G228=H228,1,0))","v":""},{"$f":"IF(G228>H228,1,0)","v":0},{"$f":"IF(AND(G228=\"\",H228=\"\"),\"\",IF(G228>H228,0,IF(H228>G228,3,IF(G228=H228,1,\"\"))))","v":""},null,null,{"$f":"IF(AND(U228=\"\",V228=\"\"),\"\",IF(U228<V228,0,IF(V228<U228,3,IF(U228=V228,1,\"\"))))","v":""},{"$f":"IF(U228>V228,1,0)","v":0},{"$f":"IF(AND(U228=\"\",V228=\"\"),\"\",IF(U228=V228,1,0))","v":""},{"$f":"IF(U228<V228,1,0)","v":0},"Bournemouth",null,null,"Southampton",{"$f":"IF(U228<V228,1,0)","v":0},{"$f":"IF(AND(U228=\"\",V228=\"\"),\"\",IF(U228=V228,1,0))","v":""},{"$f":"IF(U228>V228,1,0)","v":0},{"$f":"IF(AND(U228=\"\",V228=\"\"),\"\",IF(U228>V228,0,IF(V228>U228,3,IF(U228=V228,1,\"\"))))","v":""}]
[null,"",0,"",0,"Aston Villa",null,null,"Southampton",0,"",0,"",null,null,"",0,"",0,"Aston Villa",null,null,"Arsenal",0,"",0,""]
[null,"",0,"",0,"Brighton",null,null,"Sheffield United",0,"",0,"",null,null,"",0,"",0,"Brighton",null,null,"Newcastle",0,"",0,""]
[null,"",0,"",0,"Everton",null,null,"Arsenal",0,"",0,"",null,null,"",0,"",0,"Liverpool",null,null,"Chelsea",0,"",0,""]
[null,"",0,"",0,"Manchester City",null,null,"Leicester City",0,"",0,"",null,null,"",0,"",0,"Manchester United",null,null,"West Ham",0,"",0,""]
[null,"",0,"",0,"Newcastle",null,null,"Crystal Palace",0,"",0,"",null,null,"",0,"",0,"Norwich",null,null,"Burnley",0,"",0,""]
[null,"",0,"",0,"Norwich",null,null,"Wolverhampton",0,"",0,"",null,null,"",0,"",0,"Sheffield United",null,null,"Everton",0,"",0,""]
[null,"",0,"",0,"Tottenham",null,null,"Chelsea",0,"",0,"",null,null,"",0,"",0,"Tottenham",null,null,"Leicester City",0,"",0,""]
[null,"",0,"",0,"Watford",null,null,"Manchester United",0,"",0,"",null,null,"",0,"",0,"Watford",null,null,"Manchester City",0,"",0,""]
[null,"",0,"",0,"West Ham",null,null,"Liverpool",0,"",0,"",null,null,"",0,"",0,"Wolverhampton",null,null,"Crystal Palace",0,"",0,""]
[]
[{"$nulls":5},"JOURNEE n°19",{"$nulls":13},"JOURNEE n°38"]
[{"$nulls":5},"MERCREDI 27 DÉCEMBRE 2019",{"$nulls":13},"SAMEDI 23 MAI 2020"]
[null,{"$f":"IF(AND(G241=\"\",H241=\"\"),\"\",IF(G241<H241,0,IF(H241<G241,3,IF(G241=H241,1,\"\"))))","v":""},{"$f":"IF(G241>H241,1,0)","v":0},{"$f":"IF(AND(G241=\"\",H241=\"\"),\"\",IF(G241=H241,1,0))","v":""},{"$f":"IF(G241<H241,1,0)","v":0},"Bournemouth",null,null,"Arsenal",{"$f":"IF(G241<H241,1,0)","v":0},{"$f":"IF(AND(G241=\"\",H241=\"\"),\"\",IF(G241=H241,1,0))","v":""},{"$f":"IF(G241>H241,1,0)","v":0},{"$f":"IF(AND(G241=\"\",H241=\"\"),\"\",IF(G241>H241,0,IF(H241>G241,3,IF(G241=H241,1,\"\"))))","v":""},null,null,{"$f":"IF(AND(U241=\"\",V241=\"\"),\"\",IF(U241<V241,0,IF(V241<U241,3,IF(U241=V241,1,\"\"))))","v":""},{"$f":"IF(U241>V241,1,0)","v":0},{"$f":"IF(AND(U241=\"\",V241=\"\"),\"\",IF(U241=V241,1,0))","v":""},{"$f":"IF(U241<V241,1,0)","v":0},"Arsenal",null,null,"Watford",{"$f":"IF(U241<V241,1,0)","v":0},{"$f":"IF(AND(U241=\"\",V241=\"\"),\"\",IF(U241=V241,1,0))","v":""},{"$f":"IF(U241>V241,1,0)","v":0},{"$f":"IF(AND(U241=\"\",V241=\"\"),\"\",IF(U241>V241,0,IF(V241>U241,3,IF(U241=V241,1,\"\"))))","v":""}]
[null,"",0,"",0,"Aston Villa",null,null,"Norwich",0,"",0,"",null,null,"",0,"",0,"Burnley",null,null,"Brighton",0,"",0,""]
[null,"",0,"",0,"Chelsea",null,null,"Southampton",0,"",0,"",null,null,"",0,"",0,"Chelsea",null,null,"Wolverhampton",0,"",0,""]
[null,"",0,"",0,"Crystal Palace",null,null,"West Ham",0,"",0,"",null,null,"",0,"",0,"Crystal Palace",null,null,"Tottenham",0,"",0,""]
[null,"",0,"",0,"Everton",null,null,"Burnley",0,"",0,"",null,null,"",0,"",0,"Everton",null,null,"Bournemouth",0,"",0,""]
[null,"",0,"",0,"Leicester City",null,null,"Liverpool",0,"",0,"",null,null,"",0,"",0,"Leicester City",null,null,"Manchester United",0,"",0,""]
[null,"",0,"",0,"Manchester United",null,null,"Newcastle",0,"",0,"",null,null,"",0,"",0,"Manchester City",null,null,"Norwich",0,"",0,""]
[null,"",0,"",0,"Sheffield United",null,null,"Watford",0,"",0,"",null,null,"",0,"",0,"Newcastle",null,null,"Liverpool",0,"",0,""]
[null,"",0,"",0,"Tottenham",null,null,"Brighton",0,"",0,"",null,null,"",0,"",0,"Southampton",null,null,"Sheffield United",0,"",0,""]
[null,"",0,"",0,"Wolverhampton",null,null,"Manchester City",0,"",0,"",null,null,"",0,"",0,"West Ham",null,null,"Aston Villa",0,"",0,""]

{"sheet":"PremierLeague","index":2,"n_rows":69,"n_cols":27,"rows_kept":69,"merged":[[2,5,2,12],[2,13,2,19],[2,20,2,26]]}
[]
[]
[{"$nulls":5},"GENERAL",{"$nulls":7},"DOMICILE",{"$nulls":6},"EXTERIEUR"]
[{"$nulls":5},{"$f":"IF(Reglement!S34=\"Français\",\"Pts\",IF(Reglement!S34=\"Español\",\"Pts\",\"Pts\"))","v":"Pts"},{"$f":"IF(Reglement!S34=\"Français\",\"J\",IF(Reglement!S34=\"Español\",\"J\",\"P\"))","v":"J"},{"$f":"IF(Reglement!S34=\"Français\",\"G\",IF(Reglement!S34=\"Español\",\"G\",\"W\"))","v":"G"},{"$f":"IF(Reglement!S34=\"Français\",\"N\",IF(Reglement!S34=\"Español\",\"N\",\"D\"))","v":"N"},{"$f":"IF(Reglement!S34=\"Français\",\"P\",IF(Reglement!S34=\"Español\",\"P\",\"L\"))","v":"P"},{"$f":"IF(Reglement!S34=\"Français\",\"BP\",IF(Reglement!S34=\"Español\",\"BP\",\"G+\"))","v":"BP"},{"$f":"IF(Reglement!S34=\"Français\",\"BC\",IF(Reglement!S34=\"Español\",\"BC\",\"G-\"))","v":"BC"},{"$f":"IF(Reglement!S34=\"Français\",\"Diff.\",IF(Reglement!S34=\"Español\",\"Diff.\",\"G.A\"))","v":"Diff."},{"$f":"F4","v":"Pts"},{"$f":"H4","v":"G"},"N","P","BP","BC","Diff.","Pts",{"$f":"O4","v":"G"},"N","P","BP","BC","Diff."]
[null,null,1,{"$f":"B50","v":"Arsenal"},null,{"$f":"SUMIF(Score!$F$7:$F$250,D5,Score!$B$7:$B$250)+SUMIF(Score!$I$7:$I$250,D5,Score!$M$7:$M$250)+SUMIF(Score!$T$7:$T$250,D5,Score!$P$7:$P$250)+SUMIF(Score!$W$7:$W$250,D5,Score!$AA$7:$AA$250)","v":0},{"$f":"H5+I5+J5","v":0},{"$f":"SUMIF(Score!$F$7:$F$250,D5,Score!$C$7:$C$250)+SUMIF(Score!$I$7:$I$250,D5,Score!$J$7:$J$250)+SUMIF(Score!$T$7:$T$250,D5,Score!$Q$7:$Q$250)+SUMIF(Score!$W$7:$W$250,D5,Score!$X$7:$X$250)","v":0},{"$f":"SUMIF(Score!$F$7:$F$250,D5,Score!$D$7:$D$250)+SUMIF(Score!$I$7:$I$250,D5,Score!$K$7:$K$250)+SUMIF(Score!$T$7:$T$250,D5,Score!$R$7:$R$250)+SUMIF(Score!$W$7:$W$250,D5,Score!$Y$7:$Y$250)","v":0},{"$f":"SUMIF(Score!$F$7:$F$250,D5,Score!$E$7:$E$250)+SUMIF(Score!$I$7:$I$250,D5,Score!$L$7:$L$250)+SUMIF(Score!$T$7:$T$250,D5,Score!$S$7:$S$250)+SUMIF(Score!$W$7:$W$250,D5,Score!$Z$7:$Z$250)","v":0},{"$f":"SUMIF(Score!$F$7:$F$250,D5,Score!$G$7:$G$250)+SUMIF(Score!$I$7:$I$250,D5,Score!$H$7:$H$250)+SUMIF(Score!$T$7:$T$250,D5,Score!$U$7:$U$250)+SUMIF(Score!$W$7:$W$250,D5,Score!$V$7:$V$250)","v":0},{"$f":"SUMIF(Score!$F$7:$F$250,D5,Score!$H$7:$H$250)+SUMIF(Score!$I$7:$I$250,D5,Score!$G$7:$G$250)+SUMIF(Score!$T$7:$T$250,D5,Score!$V$7:$V$250)+SUMIF(Score!$W$7:$W$250,D5,Score!$U$7:$U$250)","v":0},{"$f":"K5-L5","v":0},{"$f":"SUMIF(Score!$F$7:$F$250,D5,Score!$B$7:$B$250)+SUMIF(Score!$T$7:$T$250,D5,Score!$P$7:$P$250)","v":0},{"$f":"SUMIF(Score!$F$7:$F$250,D5,Score!$C$7:$C$250)+SUMIF(Score!$T$7:$T$250,D5,Score!$Q$7:$Q$250)","v":0},{"$f":"SUMIF(Score!$F$7:$F$250,D5,Score!$D$7:$D$250)+SUMIF(Score!$T$7:$T$250,D5,Score!$R$7:$R$250)","v":0},{"$f":"SUMIF(Score!$F$7:$F$250,D5,Score!$E$7:$E$250)+SUMIF(Score!$T$7:$T$250,D5,Score!$S$7:$S$250)","v":0},{"$f":"SUMIF(Score!$F$7:$F$250,D5,Score!$G$7:$G$250)+SUMIF(Score!$T$7:$T$250,D5,Score!$U$7:$U$250)","v":0},{"$f":"SUMIF(Score!$F$7:$F$250,D5,Score!$H$7:$H$250)+SUMIF(Score!$T$7:$T$250,D5,Score!$V$7:$V$250)","v":0},{"$f":"R5-S5","v":0},{"$f":"SUMIF(Score!$I$7:$I$250,D5,Score!$M$7:$M$250)+SUMIF(Score!$W$7:$W$250,D5,Score!$AA$7:$AA$250)","v":0},{"$f":"SUMIF(Score!$I$7:$I$250,D5,Score!$J$7:$J$250)+SUMIF(Score!$W$7:$W$250,D5,Score!$X$7:$X$250)","v":0},{"$f":"SUMIF(Score!$I$7:$I$250,D5,Score!$K$7:$K$250)+SUMIF(Score!$W$7:$W$250,D5,Score!$Y$7:$Y$250)","v":0},{"$f":"SUMIF(Score!$I$7:$I$250,D5,Score!$L$7:$L$250)+SUMIF(Score!$W$7:$W$250,D5,Score!$Z$7:$Z$250)","v":0},{"$f":"SUMIF(Score!$I$7:$I$250,D5,Score!$H$7:$H$250)+SUMIF(Score!$W$7:$W$250,D5,Score!$V$7:$V$250)","v":0},{"$f":"SUMIF(Score!$I$7:$I$250,D5,Score!$G$7:$G$250)+SUMIF(Score!$W$7:$W$250,D5,Score!$U$7:$U$250)","v":0},{"$f":"Y5-Z5","v":0}]
[null,null,{"$f":"IF(AND(F6=F5,M5=M6,K5=K6),\"-\",2)","v":"-"},"Aston Villa",null,{"$f":"SUMIF(Score!$F$7:$F$250,D6,Score!$B$7:$B$250)+SUMIF(Score!$I$7:$I$250,D6,Score!$M$7:$M$250)+SUMIF(Score!$T$7:$T$250,D6,Score!$P$7:$P$250)+SUMIF(Score!$W$7:$W$250,D6,Score!$AA$7:$AA$250)","v":0},0,{"$f":"SUMIF(Score!$F$7:$F$250,D6,Score!$C$7:$C$250)+SUMIF(Score!$I$7:$I$250,D6,Score!$J$7:$J$250)+SUMIF(Score!$T$7:$T$250,D6,Score!$Q$7:$Q$250)+SUMIF(Score!$W$7:$W$250,D6,Score!$X$7:$X$250)","v":0},{"$f":"SUMIF(Score!$F$7:$F$250,D6,Score!$D$7:$D$250)+SUMIF(Score!$I$7:$I$250,D6,Score!$K$7:$K$250)+SUMIF(Score!$T$7:$T$250,D6,Score!$R$7:$R$250)+SUMIF(Score!$W$7:$W$250,D6,Score!$Y$7:$Y$250)","v":0},{"$f":"SUMIF(Score!$F$7:$F$250,D6,Score!$E$7:$E$250)+SUMIF(Score!$I$7:$I$250,D6,Score!$L$7:$L$250)+SUMIF(Score!$T$7:$T$250,D6,Score!$S$7:$S$250)+SUMIF(Score!$W$7:$W$250,D6,Score!$Z$7:$Z$250)","v":0},{"$f":"SUMIF(Score!$F$7:$F$250,D6,Score!$G$7:$G$250)+SUMIF(Score!$I$7:$I$250,D6,Score!$H$7:$H$250)+SUMIF(Score!$T$7:$T$250,D6,Score!$U$7:$U$250)+SUMIF(Score!$W$7:$W$250,D6,Score!$V$7:$V$250)","v":0},{"$f":"SUMIF(Score!$F$7:$F$250,D6,Score!$H$7:$H$250)+SUMIF(Score!$I$7:$I$250,D6,Score!$G$7:$G$250)+SUMIF(Score!$T$7:$T$250,D6,Score!$V$7:$V$250)+SUMIF(Score!$W$7:$W$250,D6,Score!$U$7:$U$250)","v":0},0,{"$f":"SUMIF(Score!$F$7:$F$250,D6,Score!$B$7:$B$250)+SUMIF(Score!$T$7:$T$250,D6,Score!$P$7:$P$250)","v":0},{"$f":"SUMIF(Score!$F$7:$F$250,D6,Score!$C$7:$C$250)+SUMIF(Score!$T$7:$T$250,D6,Score!$Q$7:$Q$250)","v":0},{"$f":"SUMIF(Score!$F$7:$F$250,D6,Score!$D$7:$D$250)+SUMIF(Score!$T$7:$T$250,D6,Score!$R$7:$R$250)","v":0},{"$f":"SUMIF(Score!$F$7:$F$250,D6,Score!$E$7:$E$250)+SUMIF(Score!$T$7:$T$250,D6,Score!$S$7:$S$250)","v":0},{"$f":"SUMIF(Score!$F$7:$F$250,D6,Score!$G$7:$G$250)+SUMIF(Score!$T$7:$T$250,D6,Score!$U$7:$U$250)","v":0},{"$f":"SUMIF(Score!$F$7:$F$250,D6,Score!$H$7:$H$250)+SUMIF(Score!$T$7:$T$250,D6,Score!$V$7:$V$250)","v":0},0,{"$f":"SUMIF(Score!$I$7:$I$250,D6,Score!$M$7:$M$250)+SUMIF(Score!$W$7:$W$250,D6,Score!$AA$7:$AA$250)","v":0},{"$f":"SUMIF(Score!$I$7:$I$250,D6,Score!$J$7:$J$250)+SUMIF(Score!$W$7:$W$250,D6,Score!$X$7:$X$250)","v":0},{"$f":"SUMIF(Score!$I$7:$I$250,D6,Score!$K$7:$K$250)+SUMIF(Score!$W$7:$W$250,D6,Score!$Y$7:$Y$250)","v":0},{"$f":"SUMIF(Score!$I$7:$I$250,D6,Score!$L$7:$L$250)+SUMIF(Score!$W$7:$W$250,D6,Score!$Z$7:$Z$250)","v":0},{"$f":"SUMIF(Score!$I$7:$I$250,D6,Score!$H$7:$H$250)+SUMIF(Score!$W$7:$W$250,D6,Score!$V$7:$V$250)","v":0},{"$f":"SUMIF(Score!$I$7:$I$250,D6,Score!$G$7:$G$250)+SUMIF(Score!$W$7:$W$250,D6,Score!$U$7:$U$250)","v":0},0]
[null,null,{"$f":"IF(AND(F7=F6,M6=M7,K6=K7),\"-\",3)","v":"-"},"Bournemouth",null,{"$f":"SUMIF(Score!$F$7:$F$250,D7,Score!$B$7:$B$250)+SUMIF(Score!$I$7:$I$250,D7,Score!$M$7:$M$250)+SUMIF(Score!$T$7:$T$250,D7,Score!$P$7:$P$250)+SUMIF(Score!$W$7:$W$250,D7,Score!$AA$7:$AA$250)","v":0},0,{"$f":"SUMIF(Score!$F$7:$F$250,D7,Score!$C$7:$C$250)+SUMIF(Score!$I$7:$I$250,D7,Score!$J$7:$J$250)+SUMIF(Score!$T$7:$T$250,D7,Score!$Q$7:$Q$250)+SUMIF(Score!$W$7:$W$250,D7,Score!$X$7:$X$250)","v":0},{"$f":"SUMIF(Score!$F$7:$F$250,D7,Score!$D$7:$D$250)+SUMIF(Score!$I$7:$I$250,D7,Score!$K$7:$K$250)+SUMIF(Score!$T$7:$T$250,D7,Score!$R$7:$R$250)+SUMIF(Score!$W$7:$W$250,D7,Score!$Y$7:$Y$250)","v":0},{"$f":"SUMIF(Score!$F$7:$F$250,D7,Score!$E$7:$E$250)+SUMIF(Score!$I$7:$I$250,D7,Score!$L$7:$L$250)+SUMIF(Score!$T$7:$T$250,D7,Score!$S$7:$S$250)+SUMIF(Score!$W$7:$W$250,D7,Score!$Z$7:$Z$250)","v":0},{"$f":"SUMIF(Score!$F$7:$F$250,D7,Score!$G$7:$G$250)+SUMIF(Score!$I$7:$I$250,D7,Score!$H$7:$H$250)+SUMIF(Score!$T$7:$T$250,D7,Score!$U$7:$U$250)+SUMIF(Score!$W$7:$W$250,D7,Score!$V$7:$V$250)","v":0},{"$f":"SUMIF(Score!$F$7:$F$250,D7,Score!$H$7:$H$250)+SUMIF(Score!$I$7:$I$250,D7,Score!$G$7:$G$250)+SUMIF(Score!$T$7:$T$250,D7,Score!$V$7:$V$250)+SUMIF(Score!$W$7:$W$250,D7,Score!$U$7:$U$250)","v":0},0,{"$f":"SUMIF(Score!$F$7:$F$250,D7,Score!$B$7:$B$250)+SUMIF(Score!$T$7:$T$250,D7,Score!$P$7:$P$250)","v":0},{"$f":"SUMIF(Score!$F$7:$F$250,D7,Score!$C$7:$C$250)+SUMIF(Score!$T$7:$T$250,D7,Score!$Q$7:$Q$250)","v":0},{"$f":"SUMIF(Score!$F$7:$F$250,D7,Score!$D$7:$D$250)+SUMIF(Score!$T$7:$T$250,D7,Score!$R$7:$R$250)","v":0},{"$f":"SUMIF(Score!$F$7:$F$250,D7,Score!$E$7:$E$250)+SUMIF(Score!$T$7:$T$250,D7,Score!$S$7:$S$250)","v":0},{"$f":"SUMIF(Score!$F$7:$F$250,D7,Score!$G$7:$G$250)+SUMIF(Score!$T$7:$T$250,D7,Score!$U$7:$U$250)","v":0},{"$f":"SUMIF(Score!$F$7:$F$250,D7,Score!$H$7:$H$250)+SUMIF(Score!$T$7:$T$250,D7,Score!$V$7:$V$250)","v":0},0,{"$f":"SUMIF(Score!$I$7:$I$250,D7,Score!$M$7:$M$250)+SUMIF(Score!$W$7:$W$250,D7,Score!$AA$7:$AA$250)","v":0},{"$f":"SUMIF(Score!$I$7:$I$250,D7,Score!$J$7:$J$250)+SUMIF(Score!$W$7:$W$250,D7,Score!$X$7:$X$250)","v":0},{"$f":"SUMIF(Score!$I$7:$I$250,D7,Score!$K$7:$K$250)+SUMIF(Score!$W$7:$W$250,D7,Score!$Y$7:$Y$250)","v":0},{"$f":"SUMIF(Score!$I$7:$I$250,D7,Score!$L$7:$L$250)+SUMIF(Score!$W$7:$W$250,D7,Score!$Z$7:$Z$250)","v":0},{"$f":"SUMIF(Score!$I$7:$I$250,D7,Score!$H$7:$H$250)+SUMIF(Score!$W$7:$W$250,D7,Score!$V$7:$V$250)","v":0},{"$f":"SUMIF(Score!$I$7:$I$250,D7,Score!$G$7:$G$250)+SUMIF(Score!$W$7:$W$250,D7,Score!$U$7:$U$250)","v":0},0]
[null,null,{"$f":"IF(AND(F8=F7,M7=M8,K7=K8),\"-\",4)","v":"-"},"Brighton",null,{"$f":"SUMIF(Score!$F$7:$F$250,D8,Score!$B$7:$B$250)+SUMIF(Score!$I$7:$I$250,D8,Score!$M$7:$M$250)+SUMIF(Score!$T$7:$T$250,D8,Score!$P$7:$P$250)+SUMIF(Score!$W$7:$W$250,D8,Score!$AA$7:$AA$250)","v":0},0,{"$f":"SUMIF(Score!$F$7:$F$250,D8,Score!$C$7:$C$250)+SUMIF(Score!$I$7:$I$250,D8,Score!$J$7:$J$250)+SUMIF(Score!$T$7:$T$250,D8,Score!$Q$7:$Q$250)+SUMIF(Score!$W$7:$W$250,D8,Score!$X$7:$X$250)","v":0},{"$f":"SUMIF(Score!$F$7:$F$250,D8,Score!$D$7:$D$250)+SUMIF(Score!$I$7:$I$250,D8,Score!$K$7:$K$250)+SUMIF(Score!$T$7:$T$250,D8,Score!$R$7:$R$250)+SUMIF(Score!$W$7:$W$250,D8,Score!$Y$7:$Y$250)","v":0},{"$f":"SUMIF(Score!$F$7:$F$250,D8,Score!$E$7:$E$250)+SUMIF(Score!$I$7:$I$250,D8,Score!$L$7:$L$250)+SUMIF(Score!$T$7:$T$250,D8,Score!$S$7:$S$250)+SUMIF(Score!$W$7:$W$250,D8,Score!$Z$7:$Z$250)","v":0},{"$f":"SUMIF(Score!$F$7:$F$250,D8,Score!$G$7:$G$250)+SUMIF(Score!$I$7:$I$250,D8,Score!$H$7:$H$250)+SUMIF(Score!$T$7:$T$250,D8,Score!$U$7:$U$250)+SUMIF(Score!$W$7:$W$250,D8,Score!$V$7:$V$250)","v":0},{"$f":"SUMIF(Score!$F$7:$F$250,D8,Score!$H$7:$H$250)+SUMIF(Score!$I$7:$I$250,D8,Score!$G$7:$G$250)+SUMIF(Score!$T$7:$T$250,D8,Score!$V$7:$V$250)+SUMIF(Score!$W$7:$W$250,D8,Score!$U$7:$U$250)","v":0},0,{"$f":"SUMIF(Score!$F$7:$F$250,D8,Score!$B$7:$B$250)+SUMIF(Score!$T$7:$T$250,D8,Score!$P$7:$P$250)","v":0},{"$f":"SUMIF(Score!$F$7:$F$250,D8,Score!$C$7:$C$250)+SUMIF(Score!$T$7:$T$250,D8,Score!$Q$7:$Q$250)","v":0},{"$f":"SUMIF(Score!$F$7:$F$250,D8,Score!$D$7:$D$250)+SUMIF(Score!$T$7:$T$250,D8,Score!$R$7:$R$250)","v":0},{"$f":"SUMIF(Score!$F$7:$F$250,D8,Score!$E$7:$E$250)+SUMIF(Score!$T$7:$T$250,D8,Score!$S$7:$S$250)","v":0},{"$f":"SUMIF(Score!$F$7:$F$250,D8,Score!$G$7:$G$250)+SUMIF(Score!$T$7:$T$250,D8,Score!$U$7:$U$250)","v":0},{"$f":"SUMIF(Score!$F$7:$F$250,D8,Score!$H$7:$H$250)+SUMIF(Score!$T$7:$T$250,D8,Score!$V$7:$V$250)","v":0},0,{"$f":"SUMIF(Score!$I$7:$I$250,D8,Score!$M$7:$M$250)+SUMIF(Score!$W$7:$W$250,D8,Score!$AA$7:$AA$250)","v":0},{"$f":"SUMIF(Score!$I$7:$I$250,D8,Score!$J$7:$J$250)+SUMIF(Score!$W$7:$W$250,D8,Score!$X$7:$X$250)","v":0},{"$f":"SUMIF(Score!$I$7:$I$250,D8,Score!$K$7:$K$250)+SUMIF(Score!$W$7:$W$250,D8,Score!$Y$7:$Y$250)","v":0},{"$f":"SUMIF(Score!$I$7:$I$250,D8,Score!$L$7:$L$250)+SUMIF(Score!$W$7:$W$250,D8,Score!$Z$7:$Z$250)","v":0},{"$f":"SUMIF(Score!$I$7:$I$250,D8,Score!$H$7:$H$250)+SUMIF(Score!$W$7:$W$250,D8,Score!$V$7:$V$250)","v":0},{"$f":"SUMIF(Score!$I$7:$I$250,D8,Score!$G$7:$G$250)+SUMIF(Score!$W$7:$W$250,D8,Score!$U$7:$U$250)","v":0},0]
[null,null,{"$f":"IF(AND(F9=F8,M8=M9,K8=K9),\"-\",5)","v":"-"},"Burnley",null,{"$f":"SUMIF(Score!$F$7:$F$250,D9,Score!$B$7:$B$250)+SUMIF(Score!$I$7:$I$250,D9,Score!$M$7:$M$250)+SUMIF(Score!$T$7:$T$250,D9,Score!$P$7:$P$250)+SUMIF(Score!$W$7:$W$250,D9,Score!$AA$7:$AA$250)","v":0},0,{"$f":"SUMIF(Score!$F$7:$F$250,D9,Score!$C$7:$C$250)+SUMIF(Score!$I$7:$I$250,D9,Score!$J$7:$J$250)+SUMIF(Score!$T$7:$T$250,D9,Score!$Q$7:$Q$250)+SUMIF(Score!$W$7:$W$250,D9,Score!$X$7:$X$250)","v":0},{"$f":"SUMIF(Score!$F$7:$F$250,D9,Score!$D$7:$D$250)+SUMIF(Score!$I$7:$I$250,D9,Score!$K$7:$K$250)+SUMIF(Score!$T$7:$T$250,D9,Score!$R$7:$R$250)+SUMIF(Score!$W$7:$W$250,D9,Score!$Y$7:$Y$250)","v":0},{"$f":"SUMIF(Score!$F$7:$F$250,D9,Score!$E$7:$E$250)+SUMIF(Score!$I$7:$I$250,D9,Score!$L$7:$L$250)+SUMIF(Score!$T$7:$T$250,D9,Score!$S$7:$S$250)+SUMIF(Score!$W$7:$W$250,D9,Score!$Z$7:$Z$250)","v":0},{"$f":"SUMIF(Score!$F$7:$F$250,D9,Score!$G$7:$G$250)+SUMIF(Score!$I$7:$I$250,D9,Score!$H$7:$H$250)+SUMIF(Score!$T$7:$T$250,D9,Score!$U$7:$U$250)+SUMIF(Score!$W$7:$W$250,D9,Score!$V$7:$V$250)","v":0},{"$f":"SUMIF(Score!$F$7:$F$250,D9,Score!$H$7:$H$250)+SUMIF(Score!$I$7:$I$250,D9,Score!$G$7:$G$250)+SUMIF(Score!$T$7:$T$250,D9,Score!$V$7:$V$250)+SUMIF(Score!$W$7:$W$250,D9,Score!$U$7:$U$250)","v":0},0,{"$f":"SUMIF(Score!$F$7:$F$250,D9,Score!$B$7:$B$250)+SUMIF(Score!$T$7:$T$250,D9,Score!$P$7:$P$250)","v":0},{"$f":"SUMIF(Score!$F$7:$F$250,D9,Score!$C$7:$C$250)+SUMIF(Score!$T$7:$T$250,D9,Score!$Q$7:$Q$250)","v":0},{"$f":"SUMIF(Score!$F$7:$F$250,D9,Score!$D$7:$D$250)+SUMIF(Score!$T$7:$T$250,D9,Score!$R$7:$R$250)","v":0},{"$f":"SUMIF(Score!$F$7:$F$250,D9,Score!$E$7:$E$250)+SUMIF(Score!$T$7:$T$250,D9,Score!$S$7:$S$250)","v":0},{"$f":"SUMIF(Score!$F$7:$F$250,D9,Score!$G$7:$G$250)+SUMIF(Score!$T$7:$T$250,D9,Score!$U$7:$U$250)","v":0},{"$f":"SUMIF(Score!$F$7:$F$250,D9,Score!$H$7:$H$250)+SUMIF(Score!$T$7:$T$250,D9,Score!$V$7:$V$250)","v":0},0,{"$f":"SUMIF(Score!$I$7:$I$250,D9,Score!$M$7:$M$250)+SUMIF(Score!$W$7:$W$250,D9,Score!$AA$7:$AA$250)","v":0},{"$f":"SUMIF(Score!$I$7:$I$250,D9,Score!$J$7:$J$250)+SUMIF(Score!$W$7:$W$250,D9,Score!$X$7:$X$250)","v":0},{"$f":"SUMIF(Score!$I$7:$I$250,D9,Score!$K$7:$K$250)+SUMIF(Score!$W$7:$W$250,D9,Score!$Y$7:$Y$250)","v":0},{"$f":"SUMIF(Score!$I$7:$I$250,D9,Score!$L$7:$L$250)+SUMIF(Score!$W$7:$W$250,D9,Score!$Z$7:$Z$250)","v":0},{"$f":"SUMIF(Score!$I$7:$I$250,D9,Score!$H$7:$H$250)+SUMIF(Score!$W$7:$W$250,D9,Score!$V$7:$V$250)","v":0},{"$f":"SUMIF(Score!$I$7:$I$250,D9,Score!$G$7:$G$250)+SUMIF(Score!$W$7:$W$250,D9,Score!$U$7:$U$250)","v":0},0]
[null,null,{"$f":"IF(AND(F10=F9,M9=M10,K9=K10),\"-\",6)","v":"-"},"Chelsea",null,{"$f":"SUMIF(Score!$F$7:$F$250,D10,Score!$B$7:$B$250)+SUMIF(Score!$I$7:$I$250,D10,Score!$M$7:$M$250)+SUMIF(Score!$T$7:$T$250,D10,Score!$P$7:$P$250)+SUMIF(Score!$W$7:$W$250,D10,Score!$AA$7:$AA$250)","v":0},0,{"$f":"SUMIF(Score!$F$7:$F$250,D10,Score!$C$7:$C$250)+SUMIF(Score!$I$7:$I$250,D10,Score!$J$7:$J$250)+SUMIF(Score!$T$7:$T$250,D10,Score!$Q$7:$Q$250)+SUMIF(Score!$W$7:$W$250,D10,Score!$X$7:$X$250)","v":0},{"$f":"SUMIF(Score!$F$7:$F$250,D10,Score!$D$7:$D$250)+SUMIF(Score!$I$7:$I$250,D10,Score!$K$7:$K$250)+SUMIF(Score!$T$7:$T$250,D10,Score!$R$7:$R$250)+SUMIF(Score!$W$7:$W$250,D10,Score!$Y$7:$Y$250)","v":0},{"$f":"SUMIF(Score!$F$7:$F$250,D10,Score!$E$7:$E$250)+SUMIF(Score!$I$7:$I$250,D10,Score!$L$7:$L$250)+SUMIF(Score!$T$7:$T$250,D10,Score!$S$7:$S$250)+SUMIF(Score!$W$7:$W$250,D10,Score!$Z$7:$Z$250)","v":0},{"$f":"SUMIF(Score!$F$7:$F$250,D10,Score!$G$7:$G$250)+SUMIF(Score!$I$7:$I$250,D10,Score!$H$7:$H$250)+SUMIF(Score!$T$7:$T$250,D10,Score!$U$7:$U$250)+SUMIF(Score!$W$7:$W$250,D10,Score!$V$7:$V$250)","v":0},{"$f":"SUMIF(Score!$F$7:$F$250,D10,Score!$H$7:$H$250)+SUMIF(Score!$I$7:$I$250,D10,Score!$G$7:$G$250)+SUMIF(Score!$T$7:$T$250,D10,Score!$V$7:$V$250)+SUMIF(Score!$W$7:$W$250,D10,Score!$U$7:$U$250)","v":0},0,{"$f":"SUMIF(Score!$F$7:$F$250,D10,Score!$B$7:$B$250)+SUMIF(Score!$T$7:$T$250,D10,Score!$P$7:$P$250)","v":0},{"$f":"SUMIF(Score!$F$7:$F$250,D10,Score!$C$7:$C$250)+SUMIF(Score!$T$7:$T$250,D10,Score!$Q$7:$Q$250)","v":0},{"$f":"SUMIF(Score!$F$7:$F$250,D10,Score!$D$7:$D$250)+SUMIF(Score!$T$7:$T$250,D10,Score!$R$7:$R$250)","v":0},{"$f":"SUMIF(Score!$F$7:$F$250,D10,Score!$E$7:$E$250)+SUMIF(Score!$T$7:$T$250,D10,Score!$S$7:$S$250)","v":0},{"$f":"SUMIF(Score!$F$7:$F$250,D10,Score!$G$7:$G$250)+SUMIF(Score!$T$7:$T$250,D10,Score!$U$7:$U$250)","v":0},{"$f":"SUMIF(Score!$F$7:$F$250,D10,Score!$H$7:$H$250)+SUMIF(Score!$T$7:$T$250,D10,Score!$V$7:$V$250)","v":0},0,{"$f":"SUMIF(Score!$I$7:$I$250,D10,Score!$M$7:$M$250)+SUMIF(Score!$W$7:$W$250,D10,Score!$AA$7:$AA$250)","v":0},{"$f":"SUMIF(Score!$I$7:$I$250,D10,Score!$J$7:$J$250)+SUMIF(Score!$W$7:$W$250,D10,Score!$X$7:$X$250)","v":0},{"$f":"SUMIF(Score!$I$7:$I$250,D10,Score!$K$7:$K$250)+SUMIF(Score!$W$7:$W$250,D10,Score!$Y$7:$Y$250)","v":0},{"$f":"SUMIF(Score!$I$7:$I$250,D10,Score!$L$7:$L$250)+SUMIF(Score!$W$7:$W$250,D10,Score!$Z$7:$Z$250)","v":0},{"$f":"SUMIF(Score!$I$7:$I$250,D10,Score!$H$7:$H$250)+SUMIF(Score!$W$7:$W$250,D10,Score!$V$7:$V$250)","v":0},{"$f":"SUMIF(Score!$I$7:$I$250,D10,Score!$G$7:$G$250)+SUMIF(Score!$W$7:$W$250,D10,Score!$U$7:$U$250)","v":0},0]
[null,null,{"$f":"IF(AND(F11=F10,M10=M11,K10=K11),\"-\",7)","v":"-"},"Crystal Palace",null,{"$f":"SUMIF(Score!$F$7:$F$250,D11,Score!$B$7:$B$250)+SUMIF(Score!$I$7:$I$250,D11,Score!$M$7:$M$250)+SUMIF(Score!$T$7:$T$250,D11,Score!$P$7:$P$250)+SUMIF(Score!$W$7:$W$250,D11,Score!$AA$7:$AA$250)","v":0},0,{"$f":"SUMIF(Score!$F$7:$F$250,D11,Score!$C$7:$C$250)+SUMIF(Score!$I$7:$I$250,D11,Score!$J$7:$J$250)+SUMIF(Score!$T$7:$T$250,D11,Score!$Q$7:$Q$250)+SUMIF(Score!$W$7:$W$250,D11,Score!$X$7:$X$250)","v":0},{"$f":"SUMIF(Score!$F$7:$F$250,D11,Score!$D$7:$D$250)+SUMIF(Score!$I$7:$I$250,D11,Score!$K$7:$K$250)+SUMIF(Score!$T$7:$T$250,D11,Score!$R$7:$R$250)+SUMIF(Score!$W$7:$W$250,D11,Score!$Y$7:$Y$250)","v":0},{"$f":"SUMIF(Score!$F$7:$F$250,D11,Score!$E$7:$E$250)+SUMIF(Score!$I$7:$I$250,D11,Score!$L$7:$L$250)+SUMIF(Score!$T$7:$T$250,D11,Score!$S$7:$S$250)+SUMIF(Score!$W$7:$W$250,D11,Score!$Z$7:$Z$250)","v":0},{"$f":"SUMIF(Score!$F$7:$F$250,D11,Score!$G$7:$G$250)+SUMIF(Score!$I$7:$I$250,D11,Score!$H$7:$H$250)+SUMIF(Score!$T$7:$T$250,D11,Score!$U$7:$U$250)+SUMIF(Score!$W$7:$W$250,D11,Score!$V$7:$V$250)","v":0},{"$f":"SUMIF(Score!$F$7:$F$250,D11,Score!$H$7:$H$250)+SUMIF(Score!$I$7:$I$250,D11,Score!$G$7:$G$250)+SUMIF(Score!$T$7:$T$250,D11,Score!$V$7:$V$250)+SUMIF(Score!$W$7:$W$250,D11,Score!$U$7:$U$250)","v":0},0,{"$f":"SUMIF(Score!$F$7:$F$250,D11,Score!$B$7:$B$250)+SUMIF(Score!$T$7:$T$250,D11,Score!$P$7:$P$250)","v":0},{"$f":"SUMIF(Score!$F$7:$F$250,D11,Score!$C$7:$C$250)+SUMIF(Score!$T$7:$T$250,D11,Score!$Q$7:$Q$250)","v":0},{"$f":"SUMIF(Score!$F$7:$F$250,D11,Score!$D$7:$D$250)+SUMIF(Score!$T$7:$T$250,D11,Score!$R$7:$R$250)","v":0},{"$f":"SUMIF(Score!$F$7:$F$250,D11,Score!$E$7:$E$250)+SUMIF(Score!$T$7:$T$250,D11,Score!$S$7:$S$250)","v":0},{"$f":"SUMIF(Score!$F$7:$F$250,D11,Score!$G$7:$G$250)+SUMIF(Score!$T$7:$T$250,D11,Score!$U$7:$U$250)","v":0},{"$f":"SUMIF(Score!$F$7:$F$250,D11,Score!$H$7:$H$250)+SUMIF(Score!$T$7:$T$250,D11,Score!$V$7:$V$250)","v":0},0,{"$f":"SUMIF(Score!$I$7:$I$250,D11,Score!$M$7:$M$250)+SUMIF(Score!$W$7:$W$250,D11,Score!$AA$7:$AA$250)","v":0},{"$f":"SUMIF(Score!$I$7:$I$250,D11,Score!$J$7:$J$250)+SUMIF(Score!$W$7:$W$250,D11,Score!$X$7:$X$250)","v":0},{"$f":"SUMIF(Score!$I$7:$I$250,D11,Score!$K$7:$K$250)+SUMIF(Score!$W$7:$W$250,D11,Score!$Y$7:$Y$250)","v":0},{"$f":"SUMIF(Score!$I$7:$I$250,D11,Score!$L$7:$L$250)+SUMIF(Score!$W$7:$W$250,D11,Score!$Z$7:$Z$250)","v":0},{"$f":"SUMIF(Score!$I$7:$I$250,D11,Score!$H$7:$H$250)+SUMIF(Score!$W$7:$W$250,D11,Score!$V$7:$V$250)","v":0},{"$f":"SUMIF(Score!$I$7:$I$250,D11,Score!$G$7:$G$250)+SUMIF(Score!$W$7:$W$250,D11,Score!$U$7:$U$250)","v":0},0]
[null,null,{"$f":"IF(AND(F12=F11,M11=M12,K11=K12),\"-\",8)","v":"-"},"Everton",null,{"$f":"SUMIF(Score!$F$7:$F$250,D12,Score!$B$7:$B$250)+SUMIF(Score!$I$7:$I$250,D12,Score!$M$7:$M$250)+SUMIF(Score!$T$7:$T$250,D12,Score!$P$7:$P$250)+SUMIF(Score!$W$7:$W$250,D12,Score!$AA$7:$AA$250)","v":0},0,{"$f":"SUMIF(Score!$F$7:$F$250,D12,Score!$C$7:$C$250)+SUMIF(Score!$I$7:$I$250,D12,Score!$J$7:$J$250)+SUMIF(Score!$T$7:$T$250,D12,Score!$Q$7:$Q$250)+SUMIF(Score!$W$7:$W$250,D12,Score!$X$7:$X$250)","v":0},{"$f":"SUMIF(Score!$F$7:$F$250,D12,Score!$D$7:$D$250)+SUMIF(Score!$I$7:$I$250,D12,Score!$K$7:$K$250)+SUMIF(Score!$T$7:$T$250,D12,Score!$R$7:$R$250)+SUMIF(Score!$W$7:$W$250,D12,Score!$Y$7:$Y$250)","v":0},{"$f":"SUMIF(Score!$F$7:$F$250,D12,Score!$E$7:$E$250)+SUMIF(Score!$I$7:$I$250,D12,Score!$L$7:$L$250)+SUMIF(Score!$T$7:$T$250,D12,Score!$S$7:$S$250)+SUMIF(Score!$W$7:$W$250,D12,Score!$Z$7:$Z$250)","v":0},{"$f":"SUMIF(Score!$F$7:$F$250,D12,Score!$G$7:$G$250)+SUMIF(Score!$I$7:$I$250,D12,Score!$H$7:$H$250)+SUMIF(Score!$T$7:$T$250,D12,Score!$U$7:$U$250)+SUMIF(Score!$W$7:$W$250,D12,Score!$V$7:$V$250)","v":0},{"$f":"SUMIF(Score!$F$7:$F$250,D12,Score!$H$7:$H$250)+SUMIF(Score!$I$7:$I$250,D12,Score!$G$7:$G$250)+SUMIF(Score!$T$7:$T$250,D12,Score!$V$7:$V$250)+SUMIF(Score!$W$7:$W$250,D12,Score!$U$7:$U$250)","v":0},0,{"$f":"SUMIF(Score!$F$7:$F$250,D12,Score!$B$7:$B$250)+SUMIF(Score!$T$7:$T$250,D12,Score!$P$7:$P$250)","v":0},{"$f":"SUMIF(Score!$F$7:$F$250,D12,Score!$C$7:$C$250)+SUMIF(Score!$T$7:$T$250,D12,Score!$Q$7:$Q$250)","v":0},{"$f":"SUMIF(Score!$F$7:$F$250,D12,Score!$D$7:$D$250)+SUMIF(Score!$T$7:$T$250,D12,Score!$R$7:$R$250)","v":0},{"$f":"SUMIF(Score!$F$7:$F$250,D12,Score!$E$7:$E$250)+SUMIF(Score!$T$7:$T$250,D12,Score!$S$7:$S$250)","v":0},{"$f":"SUMIF(Score!$F$7:$F$250,D12,Score!$G$7:$G$250)+SUMIF(Score!$T$7:$T$250,D12,Score!$U$7:$U$250)","v":0},{"$f":"SUMIF(Score!$F$7:$F$250,D12,Score!$H$7:$H$250)+SUMIF(Score!$T$7:$T$250,D12,Score!$V$7:$V$250)","v":0},0,{"$f":"SUMIF(Score!$I$7:$I$250,D12,Score!$M$7:$M$250)+SUMIF(Score!$W$7:$W$250,D12,Score!$AA$7:$AA$250)","v":0},{"$f":"SUMIF(Score!$I$7:$I$250,D12,Score!$J$7:$J$250)+SUMIF(Score!$W$7:$W$250,D12,Score!$X$7:$X$250)","v":0},{"$f":"SUMIF(Score!$I$7:$I$250,D12,Score!$K$7:$K$250)+SUMIF(Score!$W$7:$W$250,D12,Score!$Y$7:$Y$250)","v":0},{"$f":"SUMIF(Score!$I$7:$I$250,D12,Score!$L$7:$L$250)+SUMIF(Score!$W$7:$W$250,D12,Score!$Z$7:$Z$250)","v":0},{"$f":"SUMIF(Score!$I$7:$I$250,D12,Score!$H$7:$H$250)+SUMIF(Score!$W$7:$W$250,D12,Score!$V$7:$V$250)","v":0},{"$f":"SUMIF(Score!$I$7:$I$250,D12,Score!$G$7:$G$250)+SUMIF(Score!$W$7:$W$250,D12,Score!$U$7:$U$250)","v":0},0]
[null,null,{"$f":"IF(AND(F13=F12,M12=M13,K12=K13),\"-\",9)","v":"-"},"Leicester City",null,{"$f":"SUMIF(Score!$F$7:$F$250,D13,Score!$B$7:$B$250)+SUMIF(Score!$I$7:$I$250,D13,Score!$M$7:$M$250)+SUMIF(Score!$T$7:$T$250,D13,Score!$P$7:$P$250)+SUMIF(Score!$W$7:$W$250,D13,Score!$AA$7:$AA$250)","v":0},0,{"$f":"SUMIF(Score!$F$7:$F$250,D13,Score!$C$7:$C$250)+SUMIF(Score!$I$7:$I$250,D13,Score!$J$7:$J$250)+SUMIF(Score!$T$7:$T$250,D13,Score!$Q$7:$Q$250)+SUMIF(Score!$W$7:$W$250,D13,Score!$X$7:$X$250)","v":0},{"$f":"SUMIF(Score!$F$7:$F$250,D13,Score!$D$7:$D$250)+SUMIF(Score!$I$7:$I$250,D13,Score!$K$7:$K$250)+SUMIF(Score!$T$7:$T$250,D13,Score!$R$7:$R$250)+SUMIF(Score!$W$7:$W$250,D13,Score!$Y$7:$Y$250)","v":0},{"$f":"SUMIF(Score!$F$7:$F$250,D13,Score!$E$7:$E$250)+SUMIF(Score!$I$7:$I$250,D13,Score!$L$7:$L$250)+SUMIF(Score!$T$7:$T$250,D13,Score!$S$7:$S$250)+SUMIF(Score!$W$7:$W$250,D13,Score!$Z$7:$Z$250)","v":0},{"$f":"SUMIF(Score!$F$7:$F$250,D13,Score!$G$7:$G$250)+SUMIF(Score!$I$7:$I$250,D13,Score!$H$7:$H$250)+SUMIF(Score!$T$7:$T$250,D13,Score!$U$7:$U$250)+SUMIF(Score!$W$7:$W$250,D13,Score!$V$7:$V$250)","v":0},{"$f":"SUMIF(Score!$F$7:$F$250,D13,Score!$H$7:$H$250)+SUMIF(Score!$I$7:$I$250,D13,Score!$G$7:$G$250)+SUMIF(Score!$T$7:$T$250,D13,Score!$V$7:$V$250)+SUMIF(Score!$W$7:$W$250,D13,Score!$U$7:$U$250)","v":0},0,{"$f":"SUMIF(Score!$F$7:$F$250,D13,Score!$B$7:$B$250)+SUMIF(Score!$T$7:$T$250,D13,Score!$P$7:$P$250)","v":0},{"$f":"SUMIF(Score!$F$7:$F$250,D13,Score!$C$7:$C$250)+SUMIF(Score!$T$7:$T$250,D13,Score!$Q$7:$Q$250)","v":0},{"$f":"SUMIF(Score!$F$7:$F$250,D13,Score!$D$7:$D$250)+SUMIF(Score!$T$7:$T$250,D13,Score!$R$7:$R$250)","v":0},{"$f":"SUMIF(Score!$F$7:$F$250,D13,Score!$E$7:$E$250)+SUMIF(Score!$T$7:$T$250,D13,Score!$S$7:$S$250)","v":0},{"$f":"SUMIF(Score!$F$7:$F$250,D13,Score!$G$7:$G$250)+SUMIF(Score!$T$7:$T$250,D13,Score!$U$7:$U$250)","v":0},{"$f":"SUMIF(Score!$F$7:$F$250,D13,Score!$H$7:$H$250)+SUMIF(Score!$T$7:$T$250,D13,Score!$V$7:$V$250)","v":0},0,{"$f":"SUMIF(Score!$I$7:$I$250,D13,Score!$M$7:$M$250)+SUMIF(Score!$W$7:$W$250,D13,Score!$AA$7:$AA$250)","v":0},{"$f":"SUMIF(Score!$I$7:$I$250,D13,Score!$J$7:$J$250)+SUMIF(Score!$W$7:$W$250,D13,Score!$X$7:$X$250)","v":0},{"$f":"SUMIF(Score!$I$7:$I$250,D13,Score!$K$7:$K$250)+SUMIF(Score!$W$7:$W$250,D13,Score!$Y$7:$Y$250)","v":0},{"$f":"SUMIF(Score!$I$7:$I$250,D13,Score!$L$7:$L$250)+SUMIF(Score!$W$7:$W$250,D13,Score!$Z$7:$Z$250)","v":0},{"$f":"SUMIF(Score!$I$7:$I$250,D13,Score!$H$7:$H$250)+SUMIF(Score!$W$7:$W$250,D13,Score!$V$7:$V$250)","v":0},{"$f":"SUMIF(Score!$I$7:$I$250,D13,Score!$G$7:$G$250)+SUMIF(Score!$W$7:$W$250,D13,Score!$U$7:$U$250)","v":0},0]
[null,null,{"$f":"IF(AND(F14=F13,M13=M14,K13=K14),\"-\",10)","v":"-"},"Liverpool",null,{"$f":"SUMIF(Score!$F$7:$F$250,D14,Score!$B$7:$B$250)+SUMIF(Score!$I$7:$I$250,D14,Score!$M$7:$M$250)+SUMIF(Score!$T$7:$T$250,D14,Score!$P$7:$P$250)+SUMIF(Score!$W$7:$W$250,D14,Score!$AA$7:$AA$250)","v":0},0,{"$f":"SUMIF(Score!$F$7:$F$250,D14,Score!$C$7:$C$250)+SUMIF(Score!$I$7:$I$250,D14,Score!$J$7:$J$250)+SUMIF(Score!$T$7:$T$250,D14,Score!$Q$7:$Q$250)+SUMIF(Score!$W$7:$W$250,D14,Score!$X$7:$X$250)","v":0},{"$f":"SUMIF(Score!$F$7:$F$250,D14,Score!$D$7:$D$250)+SUMIF(Score!$I$7:$I$250,D14,Score!$K$7:$K$250)+SUMIF(Score!$T$7:$T$250,D14,Score!$R$7:$R$250)+SUMIF(Score!$W$7:$W$250,D14,Score!$Y$7:$Y$250)","v":0},{"$f":"SUMIF(Score!$F$7:$F$250,D14,Score!$E$7:$E$250)+SUMIF(Score!$I$7:$I$250,D14,Score!$L$7:$L$250)+SUMIF(Score!$T$7:$T$250,D14,Score!$S$7:$S$250)+SUMIF(Score!$W$7:$W$250,D14,Score!$Z$7:$Z$250)","v":0},{"$f":"SUMIF(Score!$F$7:$F$250,D14,Score!$G$7:$G$250)+SUMIF(Score!$I$7:$I$250,D14,Score!$H$7:$H$250)+SUMIF(Score!$T$7:$T$250,D14,Score!$U$7:$U$250)+SUMIF(Score!$W$7:$W$250,D14,Score!$V$7:$V$250)","v":0},{"$f":"SUMIF(Score!$F$7:$F$250,D14,Score!$H$7:$H$250)+SUMIF(Score!$I$7:$I$250,D14,Score!$G$7:$G$250)+SUMIF(Score!$T$7:$T$250,D14,Score!$V$7:$V$250)+SUMIF(Score!$W$7:$W$250,D14,Score!$U$7:$U$250)","v":0},0,{"$f":"SUMIF(Score!$F$7:$F$250,D14,Score!$B$7:$B$250)+SUMIF(Score!$T$7:$T$250,D14,Score!$P$7:$P$250)","v":0},{"$f":"SUMIF(Score!$F$7:$F$250,D14,Score!$C$7:$C$250)+SUMIF(Score!$T$7:$T$250,D14,Score!$Q$7:$Q$250)","v":0},{"$f":"SUMIF(Score!$F$7:$F$250,D14,Score!$D$7:$D$250)+SUMIF(Score!$T$7:$T$250,D14,Score!$R$7:$R$250)","v":0},{"$f":"SUMIF(Score!$F$7:$F$250,D14,Score!$E$7:$E$250)+SUMIF(Score!$T$7:$T$250,D14,Score!$S$7:$S$250)","v":0},{"$f":"SUMIF(Score!$F$7:$F$250,D14,Score!$G$7:$G$250)+SUMIF(Score!$T$7:$T$250,D14,Score!$U$7:$U$250)","v":0},{"$f":"SUMIF(Score!$F$7:$F$250,D14,Score!$H$7:$H$250)+SUMIF(Score!$T$7:$T$250,D14,Score!$V$7:$V$250)","v":0},0,{"$f":"SUMIF(Score!$I$7:$I$250,D14,Score!$M$7:$M$250)+SUMIF(Score!$W$7:$W$250,D14,Score!$AA$7:$AA$250)","v":0},{"$f":"SUMIF(Score!$I$7:$I$250,D14,Score!$J$7:$J$250)+SUMIF(Score!$W$7:$W$250,D14,Score!$X$7:$X$250)","v":0},{"$f":"SUMIF(Score!$I$7:$I$250,D14,Score!$K$7:$K$250)+SUMIF(Score!$W$7:$W$250,D14,Score!$Y$7:$Y$250)","v":0},{"$f":"SUMIF(Score!$I$7:$I$250,D14,Score!$L$7:$L$250)+SUMIF(Score!$W$7:$W$250,D14,Score!$Z$7:$Z$250)","v":0},{"$f":"SUMIF(Score!$I$7:$I$250,D14,Score!$H$7:$H$250)+SUMIF(Score!$W$7:$W$250,D14,Score!$V$7:$V$250)","v":0},{"$f":"SUMIF(Score!$I$7:$I$250,D14,Score!$G$7:$G$250)+SUMIF(Score!$W$7:$W$250,D14,Score!$U$7:$U$250)","v":0},0]
[null,null,{"$f":"IF(AND(F15=F14,M14=M15,K14=K15),\"-\",11)","v":"-"},"Manchester City",null,{"$f":"SUMIF(Score!$F$7:$F$250,D15,Score!$B$7:$B$250)+SUMIF(Score!$I$7:$I$250,D15,Score!$M$7:$M$250)+SUMIF(Score!$T$7:$T$250,D15,Score!$P$7:$P$250)+SUMIF(Score!$W$7:$W$250,D15,Score!$AA$7:$AA$250)","v":0},0,{"$f":"SUMIF(Score!$F$7:$F$250,D15,Score!$C$7:$C$250)+SUMIF(Score!$I$7:$I$250,D15,Score!$J$7:$J$250)+SUMIF(Score!$T$7:$T$250,D15,Score!$Q$7:$Q$250)+SUMIF(Score!$W$7:$W$250,D15,Score!$X$7:$X$250)","v":0},{"$f":"SUMIF(Score!$F$7:$F$250,D15,Score!$D$7:$D$250)+SUMIF(Score!$I$7:$I$250,D15,Score!$K$7:$K$250)+SUMIF(Score!$T$7:$T$250,D15,Score!$R$7:$R$250)+SUMIF(Score!$W$7:$W$250,D15,Score!$Y$7:$Y$250)","v":0},{"$f":"SUMIF(Score!$F$7:$F$250,D15,Score!$E$7:$E$250)+SUMIF(Score!$I$7:$I$250,D15,Score!$L$7:$L$250)+SUMIF(Score!$T$7:$T$250,D15,Score!$S$7:$S$250)+SUMIF(Score!$W$7:$W$250,D15,Score!$Z$7:$Z$250)","v":0},{"$f":"SUMIF(Score!$F$7:$F$250,D15,Score!$G$7:$G$250)+SUMIF(Score!$I$7:$I$250,D15,Score!$H$7:$H$250)+SUMIF(Score!$T$7:$T$250,D15,Score!$U$7:$U$250)+SUMIF(Score!$W$7:$W$250,D15,Score!$V$7:$V$250)","v":0},{"$f":"SUMIF(Score!$F$7:$F$250,D15,Score!$H$7:$H$250)+SUMIF(Score!$I$7:$I$250,D15,Score!$G$7:$G$250)+SUMIF(Score!$T$7:$T$250,D15,Score!$V$7:$V$250)+SUMIF(Score!$W$7:$W$250,D15,Score!$U$7:$U$250)","v":0},0,{"$f":"SUMIF(Score!$F$7:$F$250,D15,Score!$B$7:$B$250)+SUMIF(Score!$T$7:$T$250,D15,Score!$P$7:$P$250)","v":0},{"$f":"SUMIF(Score!$F$7:$F$250,D15,Score!$C$7:$C$250)+SUMIF(Score!$T$7:$T$250,D15,Score!$Q$7:$Q$250)","v":0},{"$f":"SUMIF(Score!$F$7:$F$250,D15,Score!$D$7:$D$250)+SUMIF(Score!$T$7:$T$250,D15,Score!$R$7:$R$250)","v":0},{"$f":"SUMIF(Score!$F$7:$F$250,D15,Score!$E$7:$E$250)+SUMIF(Score!$T$7:$T$250,D15,Score!$S$7:$S$250)","v":0},{"$f":"SUMIF(Score!$F$7:$F$250,D15,Score!$G$7:$G$250)+SUMIF(Score!$T$7:$T$250,D15,Score!$U$7:$U$250)","v":0},{"$f":"SUMIF(Score!$F$7:$F$250,D15,Score!$H$7:$H$250)+SUMIF(Score!$T$7:$T$250,D15,Score!$V$7:$V$250)","v":0},0,{"$f":"SUMIF(Score!$I$7:$I$250,D15,Score!$M$7:$M$250)+SUMIF(Score!$W$7:$W$250,D15,Score!$AA$7:$AA$250)","v":0},{"$f":"SUMIF(Score!$I$7:$I$250,D15,Score!$J$7:$J$250)+SUMIF(Score!$W$7:$W$250,D15,Score!$X$7:$X$250)","v":0},{"$f":"SUMIF(Score!$I$7:$I$250,D15,Score!$K$7:$K$250)+SUMIF(Score!$W$7:$W$250,D15,Score!$Y$7:$Y$250)","v":0},{"$f":"SUMIF(Score!$I$7:$I$250,D15,Score!$L$7:$L$250)+SUMIF(Score!$W$7:$W$250,D15,Score!$Z$7:$Z$250)","v":0},{"$f":"SUMIF(Score!$I$7:$I$250,D15,Score!$H$7:$H$250)+SUMIF(Score!$W$7:$W$250,D15,Score!$V$7:$V$250)","v":0},{"$f":"SUMIF(Score!$I$7:$I$250,D15,Score!$G$7:$G$250)+SUMIF(Score!$W$7:$W$250,D15,Score!$U$7:$U$250)","v":0},0]
[null,null,{"$f":"IF(AND(F16=F15,M15=M16,K15=K16),\"-\",12)","v":"-"},"Manchester United",null,{"$f":"SUMIF(Score!$F$7:$F$250,D16,Score!$B$7:$B$250)+SUMIF(Score!$I$7:$I$250,D16,Score!$M$7:$M$250)+SUMIF(Score!$T$7:$T$250,D16,Score!$P$7:$P$250)+SUMIF(Score!$W$7:$W$250,D16,Score!$AA$7:$AA$250)","v":0},0,{"$f":"SUMIF(Score!$F$7:$F$250,D16,Score!$C$7:$C$250)+SUMIF(Score!$I$7:$I$250,D16,Score!$J$7:$J$250)+SUMIF(Score!$T$7:$T$250,D16,Score!$Q$7:$Q$250)+SUMIF(Score!$W$7:$W$250,D16,Score!$X$7:$X$250)","v":0},{"$f":"SUMIF(Score!$F$7:$F$250,D16,Score!$D$7:$D$250)+SUMIF(Score!$I$7:$I$250,D16,Score!$K$7:$K$250)+SUMIF(Score!$T$7:$T$250,D16,Score!$R$7:$R$250)+SUMIF(Score!$W$7:$W$250,D16,Score!$Y$7:$Y$250)","v":0},{"$f":"SUMIF(Score!$F$7:$F$250,D16,Score!$E$7:$E$250)+SUMIF(Score!$I$7:$I$250,D16,Score!$L$7:$L$250)+SUMIF(Score!$T$7:$T$250,D16,Score!$S$7:$S$250)+SUMIF(Score!$W$7:$W$250,D16,Score!$Z$7:$Z$250)","v":0},{"$f":"SUMIF(Score!$F$7:$F$250,D16,Score!$G$7:$G$250)+SUMIF(Score!$I$7:$I$250,D16,Score!$H$7:$H$250)+SUMIF(Score!$T$7:$T$250,D16,Score!$U$7:$U$250)+SUMIF(Score!$W$7:$W$250,D16,Score!$V$7:$V$250)","v":0},{"$f":"SUMIF(Score!$F$7:$F$250,D16,Score!$H$7:$H$250)+SUMIF(Score!$I$7:$I$250,D16,Score!$G$7:$G$250)+SUMIF(Score!$T$7:$T$250,D16,Score!$V$7:$V$250)+SUMIF(Score!$W$7:$W$250,D16,Score!$U$7:$U$250)","v":0},0,{"$f":"SUMIF(Score!$F$7:$F$250,D16,Score!$B$7:$B$250)+SUMIF(Score!$T$7:$T$250,D16,Score!$P$7:$P$250)","v":0},{"$f":"SUMIF(Score!$F$7:$F$250,D16,Score!$C$7:$C$250)+SUMIF(Score!$T$7:$T$250,D16,Score!$Q$7:$Q$250)","v":0},{"$f":"SUMIF(Score!$F$7:$F$250,D16,Score!$D$7:$D$250)+SUMIF(Score!$T$7:$T$250,D16,Score!$R$7:$R$250)","v":0},{"$f":"SUMIF(Score!$F$7:$F$250,D16,Score!$E$7:$E$250)+SUMIF(Score!$T$7:$T$250,D16,Score!$S$7:$S$250)","v":0},{"$f":"SUMIF(Score!$F$7:$F$250,D16,Score!$G$7:$G$250)+SUMIF(Score!$T$7:$T$250,D16,Score!$U$7:$U$250)","v":0},{"$f":"SUMIF(Score!$F$7:$F$250,D16,Score!$H$7:$H$250)+SUMIF(Score!$T$7:$T$250,D16,Score!$V$7:$V$250)","v":0},0,{"$f":"SUMIF(Score!$I$7:$I$250,D16,Score!$M$7:$M$250)+SUMIF(Score!$W$7:$W$250,D16,Score!$AA$7:$AA$250)","v":0},{"$f":"SUMIF(Score!$I$7:$I$250,D16,Score!$J$7:$J$250)+SUMIF(Score!$W$7:$W$250,D16,Score!$X$7:$X$250)","v":0},{"$f":"SUMIF(Score!$I$7:$I$250,D16,Score!$K$7:$K$250)+SUMIF(Score!$W$7:$W$250,D16,Score!$Y$7:$Y$250)","v":0},{"$f":"SUMIF(Score!$I$7:$I$250,D16,Score!$L$7:$L$250)+SUMIF(Score!$W$7:$W$250,D16,Score!$Z$7:$Z$250)","v":0},{"$f":"SUMIF(Score!$I$7:$I$250,D16,Score!$H$7:$H$250)+SUMIF(Score!$W$7:$W$250,D16,Score!$V$7:$V$250)","v":0},{"$f":"SUMIF(Score!$I$7:$I$250,D16,Score!$G$7:$G$250)+SUMIF(Score!$W$7:$W$250,D16,Score!$U$7:$U$250)","v":0},0]
[null,null,{"$f":"IF(AND(F17=F16,M16=M17,K16=K17),\"-\",13)","v":"-"},"Newcastle",null,{"$f":"SUMIF(Score!$F$7:$F$250,D17,Score!$B$7:$B$250)+SUMIF(Score!$I$7:$I$250,D17,Score!$M$7:$M$250)+SUMIF(Score!$T$7:$T$250,D17,Score!$P$7:$P$250)+SUMIF(Score!$W$7:$W$250,D17,Score!$AA$7:$AA$250)","v":0},0,{"$f":"SUMIF(Score!$F$7:$F$250,D17,Score!$C$7:$C$250)+SUMIF(Score!$I$7:$I$250,D17,Score!$J$7:$J$250)+SUMIF(Score!$T$7:$T$250,D17,Score!$Q$7:$Q$250)+SUMIF(Score!$W$7:$W$250,D17,Score!$X$7:$X$250)","v":0},{"$f":"SUMIF(Score!$F$7:$F$250,D17,Score!$D$7:$D$250)+SUMIF(Score!$I$7:$I$250,D17,Score!$K$7:$K$250)+SUMIF(Score!$T$7:$T$250,D17,Score!$R$7:$R$250)+SUMIF(Score!$W$7:$W$250,D17,Score!$Y$7:$Y$250)","v":0},{"$f":"SUMIF(Score!$F$7:$F$250,D17,Score!$E$7:$E$250)+SUMIF(Score!$I$7:$I$250,D17,Score!$L$7:$L$250)+SUMIF(Score!$T$7:$T$250,D17,Score!$S$7:$S$250)+SUMIF(Score!$W$7:$W$250,D17,Score!$Z$7:$Z$250)","v":0},{"$f":"SUMIF(Score!$F$7:$F$250,D17,Score!$G$7:$G$250)+SUMIF(Score!$I$7:$I$250,D17,Score!$H$7:$H$250)+SUMIF(Score!$T$7:$T$250,D17,Score!$U$7:$U$250)+SUMIF(Score!$W$7:$W$250,D17,Score!$V$7:$V$250)","v":0},{"$f":"SUMIF(Score!$F$7:$F$250,D17,Score!$H$7:$H$250)+SUMIF(Score!$I$7:$I$250,D17,Score!$G$7:$G$250)+SUMIF(Score!$T$7:$T$250,D17,Score!$V$7:$V$250)+SUMIF(Score!$W$7:$W$250,D17,Score!$U$7:$U$250)","v":0},0,{"$f":"SUMIF(Score!$F$7:$F$250,D17,Score!$B$7:$B$250)+SUMIF(Score!$T$7:$T$250,D17,Score!$P$7:$P$250)","v":0},{"$f":"SUMIF(Score!$F$7:$F$250,D17,Score!$C$7:$C$250)+SUMIF(Score!$T$7:$T$250,D17,Score!$Q$7:$Q$250)","v":0},{"$f":"SUMIF(Score!$F$7:$F$250,D17,Score!$D$7:$D$250)+SUMIF(Score!$T$7:$T$250,D17,Score!$R$7:$R$250)","v":0},{"$f":"SUMIF(Score!$F$7:$F$250,D17,Score!$E$7:$E$250)+SUMIF(Score!$T$7:$T$250,D17,Score!$S$7:$S$250)","v":0},{"$f":"SUMIF(Score!$F$7:$F$250,D17,Score!$G$7:$G$250)+SUMIF(Score!$T$7:$T$250,D17,Score!$U$7:$U$250)","v":0},{"$f":"SUMIF(Score!$F$7:$F$250,D17,Score!$H$7:$H$250)+SUMIF(Score!$T$7:$T$250,D17,Score!$V$7:$V$250)","v":0},0,{"$f":"SUMIF(Score!$I$7:$I$250,D17,Score!$M$7:$M$250)+SUMIF(Score!$W$7:$W$250,D17,Score!$AA$7:$AA$250)","v":0},{"$f":"SUMIF(Score!$I$7:$I$250,D17,Score!$J$7:$J$250)+SUMIF(Score!$W$7:$W$250,D17,Score!$X$7:$X$250)","v":0},{"$f":"SUMIF(Score!$I$7:$I$250,D17,Score!$K$7:$K$250)+SUMIF(Score!$W$7:$W$250,D17,Score!$Y$7:$Y$250)","v":0},{"$f":"SUMIF(Score!$I$7:$I$250,D17,Score!$L$7:$L$250)+SUMIF(Score!$W$7:$W$250,D17,Score!$Z$7:$Z$250)","v":0},{"$f":"SUMIF(Score!$I$7:$I$250,D17,Score!$H$7:$H$250)+SUMIF(Score!$W$7:$W$250,D17,Score!$V$7:$V$250)","v":0},{"$f":"SUMIF(Score!$I$7:$I$250,D17,Score!$G$7:$G$250)+SUMIF(Score!$W$7:$W$250,D17,Score!$U$7:$U$250)","v":0},0]
[null,null,{"$f":"IF(AND(F18=F17,M17=M18,K17=K18),\"-\",14)","v":"-"},"Norwich",null,{"$f":"SUMIF(Score!$F$7:$F$250,D18,Score!$B$7:$B$250)+SUMIF(Score!$I$7:$I$250,D18,Score!$M$7:$M$250)+SUMIF(Score!$T$7:$T$250,D18,Score!$P$7:$P$250)+SUMIF(Score!$W$7:$W$250,D18,Score!$AA$7:$AA$250)","v":0},0,{"$f":"SUMIF(Score!$F$7:$F$250,D18,Score!$C$7:$C$250)+SUMIF(Score!$I$7:$I$250,D18,Score!$J$7:$J$250)+SUMIF(Score!$T$7:$T$250,D18,Score!$Q$7:$Q$250)+SUMIF(Score!$W$7:$W$250,D18,Score!$X$7:$X$250)","v":0},{"$f":"SUMIF(Score!$F$7:$F$250,D18,Score!$D$7:$D$250)+SUMIF(Score!$I$7:$I$250,D18,Score!$K$7:$K$250)+SUMIF(Score!$T$7:$T$250,D18,Score!$R$7:$R$250)+SUMIF(Score!$W$7:$W$250,D18,Score!$Y$7:$Y$250)","v":0},{"$f":"SUMIF(Score!$F$7:$F$250,D18,Score!$E$7:$E$250)+SUMIF(Score!$I$7:$I$250,D18,Score!$L$7:$L$250)+SUMIF(Score!$T$7:$T$250,D18,Score!$S$7:$S$250)+SUMIF(Score!$W$7:$W$250,D18,Score!$Z$7:$Z$250)","v":0},{"$f":"SUMIF(Score!$F$7:$F$250,D18,Score!$G$7:$G$250)+SUMIF(Score!$I$7:$I$250,D18,Score!$H$7:$H$250)+SUMIF(Score!$T$7:$T$250,D18,Score!$U$7:$U$250)+SUMIF(Score!$W$7:$W$250,D18,Score!$V$7:$V$250)","v":0},{"$f":"SUMIF(Score!$F$7:$F$250,D18,Score!$H$7:$H$250)+SUMIF(Score!$I$7:$I$250,D18,Score!$G$7:$G$250)+SUMIF(Score!$T$7:$T$250,D18,Score!$V$7:$V$250)+SUMIF(Score!$W$7:$W$250,D18,Score!$U$7:$U$250)","v":0},0,{"$f":"SUMIF(Score!$F$7:$F$250,D18,Score!$B$7:$B$250)+SUMIF(Score!$T$7:$T$250,D18,Score!$P$7:$P$250)","v":0},{"$f":"SUMIF(Score!$F$7:$F$250,D18,Score!$C$7:$C$250)+SUMIF(Score!$T$7:$T$250,D18,Score!$Q$7:$Q$250)","v":0},{"$f":"SUMIF(Score!$F$7:$F$250,D18,Score!$D$7:$D$250)+SUMIF(Score!$T$7:$T$250,D18,Score!$R$7:$R$250)","v":0},{"$f":"SUMIF(Score!$F$7:$F$250,D18,Score!$E$7:$E$250)+SUMIF(Score!$T$7:$T$250,D18,Score!$S$7:$S$250)","v":0},{"$f":"SUMIF(Score!$F$7:$F$250,D18,Score!$G$7:$G$250)+SUMIF(Score!$T$7:$T$250,D18,Score!$U$7:$U$250)","v":0},{"$f":"SUMIF(Score!$F$7:$F$250,D18,Score!$H$7:$H$250)+SUMIF(Score!$T$7:$T$250,D18,Score!$V$7:$V$250)","v":0},0,{"$f":"SUMIF(Score!$I$7:$I$250,D18,Score!$M$7:$M$250)+SUMIF(Score!$W$7:$W$250,D18,Score!$AA$7:$AA$250)","v":0},{"$f":"SUMIF(Score!$I$7:$I$250,D18,Score!$J$7:$J$250)+SUMIF(Score!$W$7:$W$250,D18,Score!$X$7:$X$250)","v":0},{"$f":"SUMIF(Score!$I$7:$I$250,D18,Score!$K$7:$K$250)+SUMIF(Score!$W$7:$W$250,D18,Score!$Y$7:$Y$250)","v":0},{"$f":"SUMIF(Score!$I$7:$I$250,D18,Score!$L$7:$L$250)+SUMIF(Score!$W$7:$W$250,D18,Score!$Z$7:$Z$250)","v":0},{"$f":"SUMIF(Score!$I$7:$I$250,D18,Score!$H$7:$H$250)+SUMIF(Score!$W$7:$W$250,D18,Score!$V$7:$V$250)","v":0},{"$f":"SUMIF(Score!$I$7:$I$250,D18,Score!$G$7:$G$250)+SUMIF(Score!$W$7:$W$250,D18,Score!$U$7:$U$250)","v":0},0]
[null,null,{"$f":"IF(AND(F19=F18,M18=M19,K18=K19),\"-\",15)","v":"-"},"Sheffield United",null,{"$f":"SUMIF(Score!$F$7:$F$250,D19,Score!$B$7:$B$250)+SUMIF(Score!$I$7:$I$250,D19,Score!$M$7:$M$250)+SUMIF(Score!$T$7:$T$250,D19,Score!$P$7:$P$250)+SUMIF(Score!$W$7:$W$250,D19,Score!$AA$7:$AA$250)","v":0},0,{"$f":"SUMIF(Score!$F$7:$F$250,D19,Score!$C$7:$C$250)+SUMIF(Score!$I$7:$I$250,D19,Score!$J$7:$J$250)+SUMIF(Score!$T$7:$T$250,D19,Score!$Q$7:$Q$250)+SUMIF(Score!$W$7:$W$250,D19,Score!$X$7:$X$250)","v":0},{"$f":"SUMIF(Score!$F$7:$F$250,D19,Score!$D$7:$D$250)+SUMIF(Score!$I$7:$I$250,D19,Score!$K$7:$K$250)+SUMIF(Score!$T$7:$T$250,D19,Score!$R$7:$R$250)+SUMIF(Score!$W$7:$W$250,D19,Score!$Y$7:$Y$250)","v":0},{"$f":"SUMIF(Score!$F$7:$F$250,D19,Score!$E$7:$E$250)+SUMIF(Score!$I$7:$I$250,D19,Score!$L$7:$L$250)+SUMIF(Score!$T$7:$T$250,D19,Score!$S$7:$S$250)+SUMIF(Score!$W$7:$W$250,D19,Score!$Z$7:$Z$250)","v":0},{"$f":"SUMIF(Score!$F$7:$F$250,D19,Score!$G$7:$G$250)+SUMIF(Score!$I$7:$I$250,D19,Score!$H$7:$H$250)+SUMIF(Score!$T$7:$T$250,D19,Score!$U$7:$U$250)+SUMIF(Score!$W$7:$W$250,D19,Score!$V$7:$V$250)","v":0},{"$f":"SUMIF(Score!$F$7:$F$250,D19,Score!$H$7:$H$250)+SUMIF(Score!$I$7:$I$250,D19,Score!$G$7:$G$250)+SUMIF(Score!$T$7:$T$250,D19,Score!$V$7:$V$250)+SUMIF(Score!$W$7:$W$250,D19,Score!$U$7:$U$250)","v":0},0,{"$f":"SUMIF(Score!$F$7:$F$250,D19,Score!$B$7:$B$250)+SUMIF(Score!$T$7:$T$250,D19,Score!$P$7:$P$250)","v":0},{"$f":"SUMIF(Score!$F$7:$F$250,D19,Score!$C$7:$C$250)+SUMIF(Score!$T$7:$T$250,D19,Score!$Q$7:$Q$250)","v":0},{"$f":"SUMIF(Score!$F$7:$F$250,D19,Score!$D$7:$D$250)+SUMIF(Score!$T$7:$T$250,D19,Score!$R$7:$R$250)","v":0},{"$f":"SUMIF(Score!$F$7:$F$250,D19,Score!$E$7:$E$250)+SUMIF(Score!$T$7:$T$250,D19,Score!$S$7:$S$250)","v":0},{"$f":"SUMIF(Score!$F$7:$F$250,D19,Score!$G$7:$G$250)+SUMIF(Score!$T$7:$T$250,D19,Score!$U$7:$U$250)","v":0},{"$f":"SUMIF(Score!$F$7:$F$250,D19,Score!$H$7:$H$250)+SUMIF(Score!$T$7:$T$250,D19,Score!$V$7:$V$250)","v":0},0,{"$f":"SUMIF(Score!$I$7:$I$250,D19,Score!$M$7:$M$250)+SUMIF(Score!$W$7:$W$250,D19,Score!$AA$7:$AA$250)","v":0},{"$f":"SUMIF(Score!$I$7:$I$250,D19,Score!$J$7:$J$250)+SUMIF(Score!$W$7:$W$250,D19,Score!$X$7:$X$250)","v":0},{"$f":"SUMIF(Score!$I$7:$I$250,D19,Score!$K$7:$K$250)+SUMIF(Score!$W$7:$W$250,D19,Score!$Y$7:$Y$250)","v":0},{"$f":"SUMIF(Score!$I$7:$I$250,D19,Score!$L$7:$L$250)+SUMIF(Score!$W$7:$W$250,D19,Score!$Z$7:$Z$250)","v":0},{"$f":"SUMIF(Score!$I$7:$I$250,D19,Score!$H$7:$H$250)+SUMIF(Score!$W$7:$W$250,D19,Score!$V$7:$V$250)","v":0},{"$f":"SUMIF(Score!$I$7:$I$250,D19,Score!$G$7:$G$250)+SUMIF(Score!$W$7:$W$250,D19,Score!$U$7:$U$250)","v":0},0]
[null,null,{"$f":"IF(AND(F20=F19,M19=M20,K19=K20),\"-\",16)","v":"-"},"Southampton",null,{"$f":"SUMIF(Score!$F$7:$F$250,D20,Score!$B$7:$B$250)+SUMIF(Score!$I$7:$I$250,D20,Score!$M$7:$M$250)+SUMIF(Score!$T$7:$T$250,D20,Score!$P$7:$P$250)+SUMIF(Score!$W$7:$W$250,D20,Score!$AA$7:$AA$250)","v":0},0,{"$f":"SUMIF(Score!$F$7:$F$250,D20,Score!$C$7:$C$250)+SUMIF(Score!$I$7:$I$250,D20,Score!$J$7:$J$250)+SUMIF(Score!$T$7:$T$250,D20,Score!$Q$7:$Q$250)+SUMIF(Score!$W$7:$W$250,D20,Score!$X$7:$X$250)","v":0},{"$f":"SUMIF(Score!$F$7:$F$250,D20,Score!$D$7:$D$250)+SUMIF(Score!$I$7:$I$250,D20,Score!$K$7:$K$250)+SUMIF(Score!$T$7:$T$250,D20,Score!$R$7:$R$250)+SUMIF(Score!$W$7:$W$250,D20,Score!$Y$7:$Y$250)","v":0},{"$f":"SUMIF(Score!$F$7:$F$250,D20,Score!$E$7:$E$250)+SUMIF(Score!$I$7:$I$250,D20,Score!$L$7:$L$250)+SUMIF(Score!$T$7:$T$250,D20,Score!$S$7:$S$250)+SUMIF(Score!$W$7:$W$250,D20,Score!$Z$7:$Z$250)","v":0},{"$f":"SUMIF(Score!$F$7:$F$250,D20,Score!$G$7:$G$250)+SUMIF(Score!$I$7:$I$250,D20,Score!$H$7:$H$250)+SUMIF(Score!$T$7:$T$250,D20,Score!$U$7:$U$250)+SUMIF(Score!$W$7:$W$250,D20,Score!$V$7:$V$250)","v":0},{"$f":"SUMIF(Score!$F$7:$F$250,D20,Score!$H$7:$H$250)+SUMIF(Score!$I$7:$I$250,D20,Score!$G$7:$G$250)+SUMIF(Score!$T$7:$T$250,D20,Score!$V$7:$V$250)+SUMIF(Score!$W$7:$W$250,D20,Score!$U$7:$U$250)","v":0},0,{"$f":"SUMIF(Score!$F$7:$F$250,D20,Score!$B$7:$B$250)+SUMIF(Score!$T$7:$T$250,D20,Score!$P$7:$P$250)","v":0},{"$f":"SUMIF(Score!$F$7:$F$250,D20,Score!$C$7:$C$250)+SUMIF(Score!$T$7:$T$250,D20,Score!$Q$7:$Q$250)","v":0},{"$f":"SUMIF(Score!$F$7:$F$250,D20,Score!$D$7:$D$250)+SUMIF(Score!$T$7:$T$250,D20,Score!$R$7:$R$250)","v":0},{"$f":"SUMIF(Score!$F$7:$F$250,D20,Score!$E$7:$E$250)+SUMIF(Score!$T$7:$T$250,D20,Score!$S$7:$S$250)","v":0},{"$f":"SUMIF(Score!$F$7:$F$250,D20,Score!$G$7:$G$250)+SUMIF(Score!$T$7:$T$250,D20,Score!$U$7:$U$250)","v":0},{"$f":"SUMIF(Score!$F$7:$F$250,D20,Score!$H$7:$H$250)+SUMIF(Score!$T$7:$T$250,D20,Score!$V$7:$V$250)","v":0},0,{"$f":"SUMIF(Score!$I$7:$I$250,D20,Score!$M$7:$M$250)+SUMIF(Score!$W$7:$W$250,D20,Score!$AA$7:$AA$250)","v":0},{"$f":"SUMIF(Score!$I$7:$I$250,D20,Score!$J$7:$J$250)+SUMIF(Score!$W$7:$W$250,D20,Score!$X$7:$X$250)","v":0},{"$f":"SUMIF(Score!$I$7:$I$250,D20,Score!$K$7:$K$250)+SUMIF(Score!$W$7:$W$250,D20,Score!$Y$7:$Y$250)","v":0},{"$f":"SUMIF(Score!$I$7:$I$250,D20,Score!$L$7:$L$250)+SUMIF(Score!$W$7:$W$250,D20,Score!$Z$7:$Z$250)","v":0},{"$f":"SUMIF(Score!$I$7:$I$250,D20,Score!$H$7:$H$250)+SUMIF(Score!$W$7:$W$250,D20,Score!$V$7:$V$250)","v":0},{"$f":"SUMIF(Score!$I$7:$I$250,D20,Score!$G$7:$G$250)+SUMIF(Score!$W$7:$W$250,D20,Score!$U$7:$U$250)","v":0},0]
[null,null,{"$f":"IF(AND(F21=F20,M20=M21,K20=K21),\"-\",17)","v":"-"},"Tottenham",null,{"$f":"SUMIF(Score!$F$7:$F$250,D21,Score!$B$7:$B$250)+SUMIF(Score!$I$7:$I$250,D21,Score!$M$7:$M$250)+SUMIF(Score!$T$7:$T$250,D21,Score!$P$7:$P$250)+SUMIF(Score!$W$7:$W$250,D21,Score!$AA$7:$AA$250)","v":0},0,{"$f":"SUMIF(Score!$F$7:$F$250,D21,Score!$C$7:$C$250)+SUMIF(Score!$I$7:$I$250,D21,Score!$J$7:$J$250)+SUMIF(Score!$T$7:$T$250,D21,Score!$Q$7:$Q$250)+SUMIF(Score!$W$7:$W$250,D21,Score!$X$7:$X$250)","v":0},{"$f":"SUMIF(Score!$F$7:$F$250,D21,Score!$D$7:$D$250)+SUMIF(Score!$I$7:$I$250,D21,Score!$K$7:$K$250)+SUMIF(Score!$T$7:$T$250,D21,Score!$R$7:$R$250)+SUMIF(Score!$W$7:$W$250,D21,Score!$Y$7:$Y$250)","v":0},{"$f":"SUMIF(Score!$F$7:$F$250,D21,Score!$E$7:$E$250)+SUMIF(Score!$I$7:$I$250,D21,Score!$L$7:$L$250)+SUMIF(Score!$T$7:$T$250,D21,Score!$S$7:$S$250)+SUMIF(Score!$W$7:$W$250,D21,Score!$Z$7:$Z$250)","v":0},{"$f":"SUMIF(Score!$F$7:$F$250,D21,Score!$G$7:$G$250)+SUMIF(Score!$I$7:$I$250,D21,Score!$H$7:$H$250)+SUMIF(Score!$T$7:$T$250,D21,Score!$U$7:$U$250)+SUMIF(Score!$W$7:$W$250,D21,Score!$V$7:$V$250)","v":0},{"$f":"SUMIF(Score!$F$7:$F$250,D21,Score!$H$7:$H$250)+SUMIF(Score!$I$7:$I$250,D21,Score!$G$7:$G$250)+SUMIF(Score!$T$7:$T$250,D21,Score!$V$7:$V$250)+SUMIF(Score!$W$7:$W$250,D21,Score!$U$7:$U$250)","v":0},0,{"$f":"SUMIF(Score!$F$7:$F$250,D21,Score!$B$7:$B$250)+SUMIF(Score!$T$7:$T$250,D21,Score!$P$7:$P$250)","v":0},{"$f":"SUMIF(Score!$F$7:$F$250,D21,Score!$C$7:$C$250)+SUMIF(Score!$T$7:$T$250,D21,Score!$Q$7:$Q$250)","v":0},{"$f":"SUMIF(Score!$F$7:$F$250,D21,Score!$D$7:$D$250)+SUMIF(Score!$T$7:$T$250,D21,Score!$R$7:$R$250)","v":0},{"$f":"SUMIF(Score!$F$7:$F$250,D21,Score!$E$7:$E$250)+SUMIF(Score!$T$7:$T$250,D21,Score!$S$7:$S$250)","v":0},{"$f":"SUMIF(Score!$F$7:$F$250,D21,Score!$G$7:$G$250)+SUMIF(Score!$T$7:$T$250,D21,Score!$U$7:$U$250)","v":0},{"$f":"SUMIF(Score!$F$7:$F$250,D21,Score!$H$7:$H$250)+SUMIF(Score!$T$7:$T$250,D21,Score!$V$7:$V$250)","v":0},0,{"$f":"SUMIF(Score!$I$7:$I$250,D21,Score!$M$7:$M$250)+SUMIF(Score!$W$7:$W$250,D21,Score!$AA$7:$AA$250)","v":0},{"$f":"SUMIF(Score!$I$7:$I$250,D21,Score!$J$7:$J$250)+SUMIF(Score!$W$7:$W$250,D21,Score!$X$7:$X$250)","v":0},{"$f":"SUMIF(Score!$I$7:$I$250,D21,Score!$K$7:$K$250)+SUMIF(Score!$W$7:$W$250,D21,Score!$Y$7:$Y$250)","v":0},{"$f":"SUMIF(Score!$I$7:$I$250,D21,Score!$L$7:$L$250)+SUMIF(Score!$W$7:$W$250,D21,Score!$Z$7:$Z$250)","v":0},{"$f":"SUMIF(Score!$I$7:$I$250,D21,Score!$H$7:$H$250)+SUMIF(Score!$W$7:$W$250,D21,Score!$V$7:$V$250)","v":0},{"$f":"SUMIF(Score!$I$7:$I$250,D21,Score!$G$7:$G$250)+SUMIF(Score!$W$7:$W$250,D21,Score!$U$7:$U$250)","v":0},0]
[null,null,{"$f":"IF(AND(F22=F21,M21=M22,K21=K22),\"-\",18)","v":"-"},"Watford",null,{"$f":"SUMIF(Score!$F$7:$F$250,D22,Score!$B$7:$B$250)+SUMIF(Score!$I$7:$I$250,D22,Score!$M$7:$M$250)+SUMIF(Score!$T$7:$T$250,D22,Score!$P$7:$P$250)+SUMIF(Score!$W$7:$W$250,D22,Score!$AA$7:$AA$250)","v":0},0,{"$f":"SUMIF(Score!$F$7:$F$250,D22,Score!$C$7:$C$250)+SUMIF(Score!$I$7:$I$250,D22,Score!$J$7:$J$250)+SUMIF(Score!$T$7:$T$250,D22,Score!$Q$7:$Q$250)+SUMIF(Score!$W$7:$W$250,D22,Score!$X$7:$X$250)","v":0},{"$f":"SUMIF(Score!$F$7:$F$250,D22,Score!$D$7:$D$250)+SUMIF(Score!$I$7:$I$250,D22,Score!$K$7:$K$250)+SUMIF(Score!$T$7:$T$250,D22,Score!$R$7:$R$250)+SUMIF(Score!$W$7:$W$250,D22,Score!$Y$7:$Y$250)","v":0},{"$f":"SUMIF(Score!$F$7:$F$250,D22,Score!$E$7:$E$250)+SUMIF(Score!$I$7:$I$250,D22,Score!$L$7:$L$250)+SUMIF(Score!$T$7:$T$250,D22,Score!$S$7:$S$250)+SUMIF(Score!$W$7:$W$250,D22,Score!$Z$7:$Z$250)","v":0},{"$f":"SUMIF(Score!$F$7:$F$250,D22,Score!$G$7:$G$250)+SUMIF(Score!$I$7:$I$250,D22,Score!$H$7:$H$250)+SUMIF(Score!$T$7:$T$250,D22,Score!$U$7:$U$250)+SUMIF(Score!$W$7:$W$250,D22,Score!$V$7:$V$250)","v":0},{"$f":"SUMIF(Score!$F$7:$F$250,D22,Score!$H$7:$H$250)+SUMIF(Score!$I$7:$I$250,D22,Score!$G$7:$G$250)+SUMIF(Score!$T$7:$T$250,D22,Score!$V$7:$V$250)+SUMIF(Score!$W$7:$W$250,D22,Score!$U$7:$U$250)","v":0},0,{"$f":"SUMIF(Score!$F$7:$F$250,D22,Score!$B$7:$B$250)+SUMIF(Score!$T$7:$T$250,D22,Score!$P$7:$P$250)","v":0},{"$f":"SUMIF(Score!$F$7:$F$250,D22,Score!$C$7:$C$250)+SUMIF(Score!$T$7:$T$250,D22,Score!$Q$7:$Q$250)","v":0},{"$f":"SUMIF(Score!$F$7:$F$250,D22,Score!$D$7:$D$250)+SUMIF(Score!$T$7:$T$250,D22,Score!$R$7:$R$250)","v":0},{"$f":"SUMIF(Score!$F$7:$F$250,D22,Score!$E$7:$E$250)+SUMIF(Score!$T$7:$T$250,D22,Score!$S$7:$S$250)","v":0},{"$f":"SUMIF(Score!$F$7:$F$250,D22,Score!$G$7:$G$250)+SUMIF(Score!$T$7:$T$250,D22,Score!$U$7:$U$250)","v":0},{"$f":"SUMIF(Score!$F$7:$F$250,D22,Score!$H$7:$H$250)+SUMIF(Score!$T$7:$T$250,D22,Score!$V$7:$V$250)","v":0},0,{"$f":"SUMIF(Score!$I$7:$I$250,D22,Score!$M$7:$M$250)+SUMIF(Score!$W$7:$W$250,D22,Score!$AA$7:$AA$250)","v":0},{"$f":"SUMIF(Score!$I$7:$I$250,D22,Score!$J$7:$J$250)+SUMIF(Score!$W$7:$W$250,D22,Score!$X$7:$X$250)","v":0},{"$f":"SUMIF(Score!$I$7:$I$250,D22,Score!$K$7:$K$250)+SUMIF(Score!$W$7:$W$250,D22,Score!$Y$7:$Y$250)","v":0},{"$f":"SUMIF(Score!$I$7:$I$250,D22,Score!$L$7:$L$250)+SUMIF(Score!$W$7:$W$250,D22,Score!$Z$7:$Z$250)","v":0},{"$f":"SUMIF(Score!$I$7:$I$250,D22,Score!$H$7:$H$250)+SUMIF(Score!$W$7:$W$250,D22,Score!$V$7:$V$250)","v":0},{"$f":"SUMIF(Score!$I$7:$I$250,D22,Score!$G$7:$G$250)+SUMIF(Score!$W$7:$W$250,D22,Score!$U$7:$U$250)","v":0},0]
[null,null,{"$f":"IF(AND(F23=F22,M22=M23,K22=K23),\"-\",19)","v":"-"},"West Ham",null,{"$f":"SUMIF(Score!$F$7:$F$250,D23,Score!$B$7:$B$250)+SUMIF(Score!$I$7:$I$250,D23,Score!$M$7:$M$250)+SUMIF(Score!$T$7:$T$250,D23,Score!$P$7:$P$250)+SUMIF(Score!$W$7:$W$250,D23,Score!$AA$7:$AA$250)","v":0},0,{"$f":"SUMIF(Score!$F$7:$F$250,D23,Score!$C$7:$C$250)+SUMIF(Score!$I$7:$I$250,D23,Score!$J$7:$J$250)+SUMIF(Score!$T$7:$T$250,D23,Score!$Q$7:$Q$250)+SUMIF(Score!$W$7:$W$250,D23,Score!$X$7:$X$250)","v":0},{"$f":"SUMIF(Score!$F$7:$F$250,D23,Score!$D$7:$D$250)+SUMIF(Score!$I$7:$I$250,D23,Score!$K$7:$K$250)+SUMIF(Score!$T$7:$T$250,D23,Score!$R$7:$R$250)+SUMIF(Score!$W$7:$W$250,D23,Score!$Y$7:$Y$250)","v":0},{"$f":"SUMIF(Score!$F$7:$F$250,D23,Score!$E$7:$E$250)+SUMIF(Score!$I$7:$I$250,D23,Score!$L$7:$L$250)+SUMIF(Score!$T$7:$T$250,D23,Score!$S$7:$S$250)+SUMIF(Score!$W$7:$W$250,D23,Score!$Z$7:$Z$250)","v":0},{"$f":"SUMIF(Score!$F$7:$F$250,D23,Score!$G$7:$G$250)+SUMIF(Score!$I$7:$I$250,D23,Score!$H$7:$H$250)+SUMIF(Score!$T$7:$T$250,D23,Score!$U$7:$U$250)+SUMIF(Score!$W$7:$W$250,D23,Score!$V$7:$V$250)","v":0},{"$f":"SUMIF(Score!$F$7:$F$250,D23,Score!$H$7:$H$250)+SUMIF(Score!$I$7:$I$250,D23,Score!$G$7:$G$250)+SUMIF(Score!$T$7:$T$250,D23,Score!$V$7:$V$250)+SUMIF(Score!$W$7:$W$250,D23,Score!$U$7:$U$250)","v":0},0,{"$f":"SUMIF(Score!$F$7:$F$250,D23,Score!$B$7:$B$250)+SUMIF(Score!$T$7:$T$250,D23,Score!$P$7:$P$250)","v":0},{"$f":"SUMIF(Score!$F$7:$F$250,D23,Score!$C$7:$C$250)+SUMIF(Score!$T$7:$T$250,D23,Score!$Q$7:$Q$250)","v":0},{"$f":"SUMIF(Score!$F$7:$F$250,D23,Score!$D$7:$D$250)+SUMIF(Score!$T$7:$T$250,D23,Score!$R$7:$R$250)","v":0},{"$f":"SUMIF(Score!$F$7:$F$250,D23,Score!$E$7:$E$250)+SUMIF(Score!$T$7:$T$250,D23,Score!$S$7:$S$250)","v":0},{"$f":"SUMIF(Score!$F$7:$F$250,D23,Score!$G$7:$G$250)+SUMIF(Score!$T$7:$T$250,D23,Score!$U$7:$U$250)","v":0},{"$f":"SUMIF(Score!$F$7:$F$250,D23,Score!$H$7:$H$250)+SUMIF(Score!$T$7:$T$250,D23,Score!$V$7:$V$250)","v":0},0,{"$f":"SUMIF(Score!$I$7:$I$250,D23,Score!$M$7:$M$250)+SUMIF(Score!$W$7:$W$250,D23,Score!$AA$7:$AA$250)","v":0},{"$f":"SUMIF(Score!$I$7:$I$250,D23,Score!$J$7:$J$250)+SUMIF(Score!$W$7:$W$250,D23,Score!$X$7:$X$250)","v":0},{"$f":"SUMIF(Score!$I$7:$I$250,D23,Score!$K$7:$K$250)+SUMIF(Score!$W$7:$W$250,D23,Score!$Y$7:$Y$250)","v":0},{"$f":"SUMIF(Score!$I$7:$I$250,D23,Score!$L$7:$L$250)+SUMIF(Score!$W$7:$W$250,D23,Score!$Z$7:$Z$250)","v":0},{"$f":"SUMIF(Score!$I$7:$I$250,D23,Score!$H$7:$H$250)+SUMIF(Score!$W$7:$W$250,D23,Score!$V$7:$V$250)","v":0},{"$f":"SUMIF(Score!$I$7:$I$250,D23,Score!$G$7:$G$250)+SUMIF(Score!$W$7:$W$250,D23,Score!$U$7:$U$250)","v":0},0]
[null,null,{"$f":"IF(AND(F24=F23,M23=M24,K23=K24),\"-\",20)","v":"-"},"Wolverhampton",null,{"$f":"SUMIF(Score!$F$7:$F$250,D24,Score!$B$7:$B$250)+SUMIF(Score!$I$7:$I$250,D24,Score!$M$7:$M$250)+SUMIF(Score!$T$7:$T$250,D24,Score!$P$7:$P$250)+SUMIF(Score!$W$7:$W$250,D24,Score!$AA$7:$AA$250)","v":0},0,{"$f":"SUMIF(Score!$F$7:$F$250,D24,Score!$C$7:$C$250)+SUMIF(Score!$I$7:$I$250,D24,Score!$J$7:$J$250)+SUMIF(Score!$T$7:$T$250,D24,Score!$Q$7:$Q$250)+SUMIF(Score!$W$7:$W$250,D24,Score!$X$7:$X$250)","v":0},{"$f":"SUMIF(Score!$F$7:$F$250,D24,Score!$D$7:$D$250)+SUMIF(Score!$I$7:$I$250,D24,Score!$K$7:$K$250)+SUMIF(Score!$T$7:$T$250,D24,Score!$R$7:$R$250)+SUMIF(Score!$W$7:$W$250,D24,Score!$Y$7:$Y$250)","v":0},{"$f":"SUMIF(Score!$F$7:$F$250,D24,Score!$E$7:$E$250)+SUMIF(Score!$I$7:$I$250,D24,Score!$L$7:$L$250)+SUMIF(Score!$T$7:$T$250,D24,Score!$S$7:$S$250)+SUMIF(Score!$W$7:$W$250,D24,Score!$Z$7:$Z$250)","v":0},{"$f":"SUMIF(Score!$F$7:$F$250,D24,Score!$G$7:$G$250)+SUMIF(Score!$I$7:$I$250,D24,Score!$H$7:$H$250)+SUMIF(Score!$T$7:$T$250,D24,Score!$U$7:$U$250)+SUMIF(Score!$W$7:$W$250,D24,Score!$V$7:$V$250)","v":0},{"$f":"SUMIF(Score!$F$7:$F$250,D24,Score!$H$7:$H$250)+SUMIF(Score!$I$7:$I$250,D24,Score!$G$7:$G$250)+SUMIF(Score!$T$7:$T$250,D24,Score!$V$7:$V$250)+SUMIF(Score!$W$7:$W$250,D24,Score!$U$7:$U$250)","v":0},0,{"$f":"SUMIF(Score!$F$7:$F$250,D24,Score!$B$7:$B$250)+SUMIF(Score!$T$7:$T$250,D24,Score!$P$7:$P$250)","v":0},{"$f":"SUMIF(Score!$F$7:$F$250,D24,Score!$C$7:$C$250)+SUMIF(Score!$T$7:$T$250,D24,Score!$Q$7:$Q$250)","v":0},{"$f":"SUMIF(Score!$F$7:$F$250,D24,Score!$D$7:$D$250)+SUMIF(Score!$T$7:$T$250,D24,Score!$R$7:$R$250)","v":0},{"$f":"SUMIF(Score!$F$7:$F$250,D24,Score!$E$7:$E$250)+SUMIF(Score!$T$7:$T$250,D24,Score!$S$7:$S$250)","v":0},{"$f":"SUMIF(Score!$F$7:$F$250,D24,Score!$G$7:$G$250)+SUMIF(Score!$T$7:$T$250,D24,Score!$U$7:$U$250)","v":0},{"$f":"SUMIF(Score!$F$7:$F$250,D24,Score!$H$7:$H$250)+SUMIF(Score!$T$7:$T$250,D24,Score!$V$7:$V$250)","v":0},0,{"$f":"SUMIF(Score!$I$7:$I$250,D24,Score!$M$7:$M$250)+SUMIF(Score!$W$7:$W$250,D24,Score!$AA$7:$AA$250)","v":0},{"$f":"SUMIF(Score!$I$7:$I$250,D24,Score!$J$7:$J$250)+SUMIF(Score!$W$7:$W$250,D24,Score!$X$7:$X$250)","v":0},{"$f":"SUMIF(Score!$I$7:$I$250,D24,Score!$K$7:$K$250)+SUMIF(Score!$W$7:$W$250,D24,Score!$Y$7:$Y$250)","v":0},{"$f":"SUMIF(Score!$I$7:$I$250,D24,Score!$L$7:$L$250)+SUMIF(Score!$W$7:$W$250,D24,Score!$Z$7:$Z$250)","v":0},{"$f":"SUMIF(Score!$I$7:$I$250,D24,Score!$H$7:$H$250)+SUMIF(Score!$W$7:$W$250,D24,Score!$V$7:$V$250)","v":0},{"$f":"SUMIF(Score!$I$7:$I$250,D24,Score!$G$7:$G$250)+SUMIF(Score!$W$7:$W$250,D24,Score!$U$7:$U$250)","v":0},0]
[]
[]
[]
[{"$nulls":5},"PTS",null,"V",null,null,"BP","BC"]
[null,"Arsenal",1,{"$f":"F29*1000000000+M29*10000000+K29*10000+H29*100-C29","v":-1},{"$f":"RANK(D29,$D$29:$D$48)","v":1},{"$f":"SUMIF(Score!$F$7:$F$250,B29,Score!$B$7:$B$250)+SUMIF(Score!$I$7:$I$250,B29,Score!$M$7:$M$250)+SUMIF(Score!$T$7:$T$250,B29,Score!$P$7:$P$250)+SUMIF(Score!$W$7:$W$250,B29,Score!$AA$7:$AA$250)","v":0},{"$f":"B29","v":"Arsenal"},{"$f":"SUMIF(Score!$F$7:$F$250,B29,Score!$C$7:$C$250)+SUMIF(Score!$I$7:$I$250,B29,Score!$J$7:$J$250)+SUMIF(Score!$T$7:$T$250,B29,Score!$Q$7:$Q$250)+SUMIF(Score!$W$7:$W$250,B29,Score!$X$7:$X$250)","v":0},null,null,{"$f":"SUMIF(Score!$F$7:$F$250,B29,Score!$G$7:$G$250)+SUMIF(Score!$I$7:$I$250,B29,Score!$H$7:$H$250)+SUMIF(Score!$T$7:$T$250,B29,Score!$U$7:$U$250)+SUMIF(Score!$W$7:$W$250,B29,Score!$V$7:$V$250)","v":0},{"$f":"SUMIF(Score!$F$7:$F$250,B29,Score!$H$7:$H$250)+SUMIF(Score!$I$7:$I$250,B29,Score!$G$7:$G$250)+SUMIF(Score!$T$7:$T$250,B29,Score!$V$7:$V$250)+SUMIF(Score!$W$7:$W$250,B29,Score!$U$7:$U$250)","v":0},{"$f":"K29-L29","v":0}]
[null,"Aston Villa",2,-2,2,{"$f":"SUMIF(Score!$F$7:$F$250,B30,Score!$B$7:$B$250)+SUMIF(Score!$I$7:$I$250,B30,Score!$M$7:$M$250)+SUMIF(Score!$T$7:$T$250,B30,Score!$P$7:$P$250)+SUMIF(Score!$W$7:$W$250,B30,Score!$AA$7:$AA$250)","v":0},"Aston Villa",{"$f":"SUMIF(Score!$F$7:$F$250,B30,Score!$C$7:$C$250)+SUMIF(Score!$I$7:$I$250,B30,Score!$J$7:$J$250)+SUMIF(Score!$T$7:$T$250,B30,Score!$Q$7:$Q$250)+SUMIF(Score!$W$7:$W$250,B30,Score!$X$7:$X$250)","v":0},null,null,{"$f":"SUMIF(Score!$F$7:$F$250,B30,Score!$G$7:$G$250)+SUMIF(Score!$I$7:$I$250,B30,Score!$H$7:$H$250)+SUMIF(Score!$T$7:$T$250,B30,Score!$U$7:$U$250)+SUMIF(Score!$W$7:$W$250,B30,Score!$V$7:$V$250)","v":0},{"$f":"SUMIF(Score!$F$7:$F$250,B30,Score!$H$7:$H$250)+SUMIF(Score!$I$7:$I$250,B30,Score!$G$7:$G$250)+SUMIF(Score!$T$7:$T$250,B30,Score!$V$7:$V$250)+SUMIF(Score!$W$7:$W$250,B30,Score!$U$7:$U$250)","v":0},0]
[null,"Bournemouth",3,-3,3,{"$f":"SUMIF(Score!$F$7:$F$250,B31,Score!$B$7:$B$250)+SUMIF(Score!$I$7:$I$250,B31,Score!$M$7:$M$250)+SUMIF(Score!$T$7:$T$250,B31,Score!$P$7:$P$250)+SUMIF(Score!$W$7:$W$250,B31,Score!$AA$7:$AA$250)","v":0},"Bournemouth",{"$f":"SUMIF(Score!$F$7:$F$250,B31,Score!$C$7:$C$250)+SUMIF(Score!$I$7:$I$250,B31,Score!$J$7:$J$250)+SUMIF(Score!$T$7:$T$250,B31,Score!$Q$7:$Q$250)+SUMIF(Score!$W$7:$W$250,B31,Score!$X$7:$X$250)","v":0},null,null,{"$f":"SUMIF(Score!$F$7:$F$250,B31,Score!$G$7:$G$250)+SUMIF(Score!$I$7:$I$250,B31,Score!$H$7:$H$250)+SUMIF(Score!$T$7:$T$250,B31,Score!$U$7:$U$250)+SUMIF(Score!$W$7:$W$250,B31,Score!$V$7:$V$250)","v":0},{"$f":"SUMIF(Score!$F$7:$F$250,B31,Score!$H$7:$H$250)+SUMIF(Score!$I$7:$I$250,B31,Score!$G$7:$G$250)+SUMIF(Score!$T$7:$T$250,B31,Score!$V$7:$V$250)+SUMIF(Score!$W$7:$W$250,B31,Score!$U$7:$U$250)","v":0},0]
[null,"Brighton",4,-4,4,{"$f":"SUMIF(Score!$F$7:$F$250,B32,Score!$B$7:$B$250)+SUMIF(Score!$I$7:$I$250,B32,Score!$M$7:$M$250)+SUMIF(Score!$T$7:$T$250,B32,Score!$P$7:$P$250)+SUMIF(Score!$W$7:$W$250,B32,Score!$AA$7:$AA$250)","v":0},"Brighton",{"$f":"SUMIF(Score!$F$7:$F$250,B32,Score!$C$7:$C$250)+SUMIF(Score!$I$7:$I$250,B32,Score!$J$7:$J$250)+SUMIF(Score!$T$7:$T$250,B32,Score!$Q$7:$Q$250)+SUMIF(Score!$W$7:$W$250,B32,Score!$X$7:$X$250)","v":0},null,null,{"$f":"SUMIF(Score!$F$7:$F$250,B32,Score!$G$7:$G$250)+SUMIF(Score!$I$7:$I$250,B32,Score!$H$7:$H$250)+SUMIF(Score!$T$7:$T$250,B32,Score!$U$7:$U$250)+SUMIF(Score!$W$7:$W$250,B32,Score!$V$7:$V$250)","v":0},{"$f":"SUMIF(Score!$F$7:$F$250,B32,Score!$H$7:$H$250)+SUMIF(Score!$I$7:$I$250,B32,Score!$G$7:$G$250)+SUMIF(Score!$T$7:$T$250,B32,Score!$V$7:$V$250)+SUMIF(Score!$W$7:$W$250,B32,Score!$U$7:$U$250)","v":0},0]
[null,"Burnley",5,-5,5,{"$f":"SUMIF(Score!$F$7:$F$250,B33,Score!$B$7:$B$250)+SUMIF(Score!$I$7:$I$250,B33,Score!$M$7:$M$250)+SUMIF(Score!$T$7:$T$250,B33,Score!$P$7:$P$250)+SUMIF(Score!$W$7:$W$250,B33,Score!$AA$7:$AA$250)","v":0},"Burnley",{"$f":"SUMIF(Score!$F$7:$F$250,B33,Score!$C$7:$C$250)+SUMIF(Score!$I$7:$I$250,B33,Score!$J$7:$J$250)+SUMIF(Score!$T$7:$T$250,B33,Score!$Q$7:$Q$250)+SUMIF(Score!$W$7:$W$250,B33,Score!$X$7:$X$250)","v":0},null,null,{"$f":"SUMIF(Score!$F$7:$F$250,B33,Score!$G$7:$G$250)+SUMIF(Score!$I$7:$I$250,B33,Score!$H$7:$H$250)+SUMIF(Score!$T$7:$T$250,B33,Score!$U$7:$U$250)+SUMIF(Score!$W$7:$W$250,B33,Score!$V$7:$V$250)","v":0},{"$f":"SUMIF(Score!$F$7:$F$250,B33,Score!$H$7:$H$250)+SUMIF(Score!$I$7:$I$250,B33,Score!$G$7:$G$250)+SUMIF(Score!$T$7:$T$250,B33,Score!$V$7:$V$250)+SUMIF(Score!$W$7:$W$250,B33,Score!$U$7:$U$250)","v":0},0]
[null,"Chelsea",6,-6,6,{"$f":"SUMIF(Score!$F$7:$F$250,B34,Score!$B$7:$B$250)+SUMIF(Score!$I$7:$I$250,B34,Score!$M$7:$M$250)+SUMIF(Score!$T$7:$T$250,B34,Score!$P$7:$P$250)+SUMIF(Score!$W$7:$W$250,B34,Score!$AA$7:$AA$250)","v":0},"Chelsea",{"$f":"SUMIF(Score!$F$7:$F$250,B34,Score!$C$7:$C$250)+SUMIF(Score!$I$7:$I$250,B34,Score!$J$7:$J$250)+SUMIF(Score!$T$7:$T$250,B34,Score!$Q$7:$Q$250)+SUMIF(Score!$W$7:$W$250,B34,Score!$X$7:$X$250)","v":0},null,null,{"$f":"SUMIF(Score!$F$7:$F$250,B34,Score!$G$7:$G$250)+SUMIF(Score!$I$7:$I$250,B34,Score!$H$7:$H$250)+SUMIF(Score!$T$7:$T$250,B34,Score!$U$7:$U$250)+SUMIF(Score!$W$7:$W$250,B34,Score!$V$7:$V$250)","v":0},{"$f":"SUMIF(Score!$F$7:$F$250,B34,Score!$H$7:$H$250)+SUMIF(Score!$I$7:$I$250,B34,Score!$G$7:$G$250)+SUMIF(Score!$T$7:$T$250,B34,Score!$V$7:$V$250)+SUMIF(Score!$W$7:$W$250,B34,Score!$U$7:$U$250)","v":0},0]
[null,"Crystal Palace",7,-7,7,{"$f":"SUMIF(Score!$F$7:$F$250,B35,Score!$B$7:$B$250)+SUMIF(Score!$I$7:$I$250,B35,Score!$M$7:$M$250)+SUMIF(Score!$T$7:$T$250,B35,Score!$P$7:$P$250)+SUMIF(Score!$W$7:$W$250,B35,Score!$AA$7:$AA$250)","v":0},"Crystal Palace",{"$f":"SUMIF(Score!$F$7:$F$250,B35,Score!$C$7:$C$250)+SUMIF(Score!$I$7:$I$250,B35,Score!$J$7:$J$250)+SUMIF(Score!$T$7:$T$250,B35,Score!$Q$7:$Q$250)+SUMIF(Score!$W$7:$W$250,B35,Score!$X$7:$X$250)","v":0},null,null,{"$f":"SUMIF(Score!$F$7:$F$250,B35,Score!$G$7:$G$250)+SUMIF(Score!$I$7:$I$250,B35,Score!$H$7:$H$250)+SUMIF(Score!$T$7:$T$250,B35,Score!$U$7:$U$250)+SUMIF(Score!$W$7:$W$250,B35,Score!$V$7:$V$250)","v":0},{"$f":"SUMIF(Score!$F$7:$F$250,B35,Score!$H$7:$H$250)+SUMIF(Score!$I$7:$I$250,B35,Score!$G$7:$G$250)+SUMIF(Score!$T$7:$T$250,B35,Score!$V$7:$V$250)+SUMIF(Score!$W$7:$W$250,B35,Score!$U$7:$U$250)","v":0},0]
[null,"Everton",8,-8,8,{"$f":"SUMIF(Score!$F$7:$F$250,B36,Score!$B$7:$B$250)+SUMIF(Score!$I$7:$I$250,B36,Score!$M$7:$M$250)+SUMIF(Score!$T$7:$T$250,B36,Score!$P$7:$P$250)+SUMIF(Score!$W$7:$W$250,B36,Score!$AA$7:$AA$250)","v":0},"Everton",{"$f":"SUMIF(Score!$F$7:$F$250,B36,Score!$C$7:$C$250)+SUMIF(Score!$I$7:$I$250,B36,Score!$J$7:$J$250)+SUMIF(Score!$T$7:$T$250,B36,Score!$Q$7:$Q$250)+SUMIF(Score!$W$7:$W$250,B36,Score!$X$7:$X$250)","v":0},null,null,{"$f":"SUMIF(Score!$F$7:$F$250,B36,Score!$G$7:$G$250)+SUMIF(Score!$I$7:$I$250,B36,Score!$H$7:$H$250)+SUMIF(Score!$T$7:$T$250,B36,Score!$U$7:$U$250)+SUMIF(Score!$W$7:$W$250,B36,Score!$V$7:$V$250)","v":0},{"$f":"SUMIF(Score!$F$7:$F$250,B36,Score!$H$7:$H$250)+SUMIF(Score!$I$7:$I$250,B36,Score!$G$7:$G$250)+SUMIF(Score!$T$7:$T$250,B36,Score!$V$7:$V$250)+SUMIF(Score!$W$7:$W$250,B36,Score!$U$7:$U$250)","v":0},0]
[null,"Leicester City",9,-9,9,{"$f":"SUMIF(Score!$F$7:$F$250,B37,Score!$B$7:$B$250)+SUMIF(Score!$I$7:$I$250,B37,Score!$M$7:$M$250)+SUMIF(Score!$T$7:$T$250,B37,Score!$P$7:$P$250)+SUMIF(Score!$W$7:$W$250,B37,Score!$AA$7:$AA$250)","v":0},"Leicester City",{"$f":"SUMIF(Score!$F$7:$F$250,B37,Score!$C$7:$C$250)+SUMIF(Score!$I$7:$I$250,B37,Score!$J$7:$J$250)+SUMIF(Score!$T$7:$T$250,B37,Score!$Q$7:$Q$250)+SUMIF(Score!$W$7:$W$250,B37,Score!$X$7:$X$250)","v":0},null,null,{"$f":"SUMIF(Score!$F$7:$F$250,B37,Score!$G$7:$G$250)+SUMIF(Score!$I$7:$I$250,B37,Score!$H$7:$H$250)+SUMIF(Score!$T$7:$T$250,B37,Score!$U$7:$U$250)+SUMIF(Score!$W$7:$W$250,B37,Score!$V$7:$V$250)","v":0},{"$f":"SUMIF(Score!$F$7:$F$250,B37,Score!$H$7:$H$250)+SUMIF(Score!$I$7:$I$250,B37,Score!$G$7:$G$250)+SUMIF(Score!$T$7:$T$250,B37,Score!$V$7:$V$250)+SUMIF(Score!$W$7:$W$250,B37,Score!$U$7:$U$250)","v":0},0]
[null,"Liverpool",10,-10,10,{"$f":"SUMIF(Score!$F$7:$F$250,B38,Score!$B$7:$B$250)+SUMIF(Score!$I$7:$I$250,B38,Score!$M$7:$M$250)+SUMIF(Score!$T$7:$T$250,B38,Score!$P$7:$P$250)+SUMIF(Score!$W$7:$W$250,B38,Score!$AA$7:$AA$250)","v":0},"Liverpool",{"$f":"SUMIF(Score!$F$7:$F$250,B38,Score!$C$7:$C$250)+SUMIF(Score!$I$7:$I$250,B38,Score!$J$7:$J$250)+SUMIF(Score!$T$7:$T$250,B38,Score!$Q$7:$Q$250)+SUMIF(Score!$W$7:$W$250,B38,Score!$X$7:$X$250)","v":0},null,null,{"$f":"SUMIF(Score!$F$7:$F$250,B38,Score!$G$7:$G$250)+SUMIF(Score!$I$7:$I$250,B38,Score!$H$7:$H$250)+SUMIF(Score!$T$7:$T$250,B38,Score!$U$7:$U$250)+SUMIF(Score!$W$7:$W$250,B38,Score!$V$7:$V$250)","v":0},{"$f":"SUMIF(Score!$F$7:$F$250,B38,Score!$H$7:$H$250)+SUMIF(Score!$I$7:$I$250,B38,Score!$G$7:$G$250)+SUMIF(Score!$T$7:$T$250,B38,Score!$V$7:$V$250)+SUMIF(Score!$W$7:$W$250,B38,Score!$U$7:$U$250)","v":0},0]
[null,"Manchester City",11,-11,11,{"$f":"SUMIF(Score!$F$7:$F$250,B39,Score!$B$7:$B$250)+SUMIF(Score!$I$7:$I$250,B39,Score!$M$7:$M$250)+SUMIF(Score!$T$7:$T$250,B39,Score!$P$7:$P$250)+SUMIF(Score!$W$7:$W$250,B39,Score!$AA$7:$AA$250)","v":0},"Manchester City",{"$f":"SUMIF(Score!$F$7:$F$250,B39,Score!$C$7:$C$250)+SUMIF(Score!$I$7:$I$250,B39,Score!$J$7:$J$250)+SUMIF(Score!$T$7:$T$250,B39,Score!$Q$7:$Q$250)+SUMIF(Score!$W$7:$W$250,B39,Score!$X$7:$X$250)","v":0},null,null,{"$f":"SUMIF(Score!$F$7:$F$250,B39,Score!$G$7:$G$250)+SUMIF(Score!$I$7:$I$250,B39,Score!$H$7:$H$250)+SUMIF(Score!$T$7:$T$250,B39,Score!$U$7:$U$250)+SUMIF(Score!$W$7:$W$250,B39,Score!$V$7:$V$250)","v":0},{"$f":"SUMIF(Score!$F$7:$F$250,B39,Score!$H$7:$H$250)+SUMIF(Score!$I$7:$I$250,B39,Score!$G$7:$G$250)+SUMIF(Score!$T$7:$T$250,B39,Score!$V$7:$V$250)+SUMIF(Score!$W$7:$W$250,B39,Score!$U$7:$U$250)","v":0},0]
[null,"Manchester United",12,-12,12,{"$f":"SUMIF(Score!$F$7:$F$250,B40,Score!$B$7:$B$250)+SUMIF(Score!$I$7:$I$250,B40,Score!$M$7:$M$250)+SUMIF(Score!$T$7:$T$250,B40,Score!$P$7:$P$250)+SUMIF(Score!$W$7:$W$250,B40,Score!$AA$7:$AA$250)","v":0},"Manchester United",{"$f":"SUMIF(Score!$F$7:$F$250,B40,Score!$C$7:$C$250)+SUMIF(Score!$I$7:$I$250,B40,Score!$J$7:$J$250)+SUMIF(Score!$T$7:$T$250,B40,Score!$Q$7:$Q$250)+SUMIF(Score!$W$7:$W$250,B40,Score!$X$7:$X$250)","v":0},null,null,{"$f":"SUMIF(Score!$F$7:$F$250,B40,Score!$G$7:$G$250)+SUMIF(Score!$I$7:$I$250,B40,Score!$H$7:$H$250)+SUMIF(Score!$T$7:$T$250,B40,Score!$U$7:$U$250)+SUMIF(Score!$W$7:$W$250,B40,Score!$V$7:$V$250)","v":0},{"$f":"SUMIF(Score!$F$7:$F$250,B40,Score!$H$7:$H$250)+SUMIF(Score!$I$7:$I$250,B40,Score!$G$7:$G$250)+SUMIF(Score!$T$7:$T$250,B40,Score!$V$7:$V$250)+SUMIF(Score!$W$7:$W$250,B40,Score!$U$7:$U$250)","v":0},0]
[null,"Newcastle",13,-13,13,{"$f":"SUMIF(Score!$F$7:$F$250,B41,Score!$B$7:$B$250)+SUMIF(Score!$I$7:$I$250,B41,Score!$M$7:$M$250)+SUMIF(Score!$T$7:$T$250,B41,Score!$P$7:$P$250)+SUMIF(Score!$W$7:$W$250,B41,Score!$AA$7:$AA$250)","v":0},"Newcastle",{"$f":"SUMIF(Score!$F$7:$F$250,B41,Score!$C$7:$C$250)+SUMIF(Score!$I$7:$I$250,B41,Score!$J$7:$J$250)+SUMIF(Score!$T$7:$T$250,B41,Score!$Q$7:$Q$250)+SUMIF(Score!$W$7:$W$250,B41,Score!$X$7:$X$250)","v":0},null,null,{"$f":"SUMIF(Score!$F$7:$F$250,B41,Score!$G$7:$G$250)+SUMIF(Score!$I$7:$I$250,B41,Score!$H$7:$H$250)+SUMIF(Score!$T$7:$T$250,B41,Score!$U$7:$U$250)+SUMIF(Score!$W$7:$W$250,B41,Score!$V$7:$V$250)","v":0},{"$f":"SUMIF(Score!$F$7:$F$250,B41,Score!$H$7:$H$250)+SUMIF(Score!$I$7:$I$250,B41,Score!$G$7:$G$250)+SUMIF(Score!$T$7:$T$250,B41,Score!$V$7:$V$250)+SUMIF(Score!$W$7:$W$250,B41,Score!$U$7:$U$250)","v":0},0]
[null,"Norwich",14,-14,14,{"$f":"SUMIF(Score!$F$7:$F$250,B42,Score!$B$7:$B$250)+SUMIF(Score!$I$7:$I$250,B42,Score!$M$7:$M$250)+SUMIF(Score!$T$7:$T$250,B42,Score!$P$7:$P$250)+SUMIF(Score!$W$7:$W$250,B42,Score!$AA$7:$AA$250)","v":0},"Norwich",{"$f":"SUMIF(Score!$F$7:$F$250,B42,Score!$C$7:$C$250)+SUMIF(Score!$I$7:$I$250,B42,Score!$J$7:$J$250)+SUMIF(Score!$T$7:$T$250,B42,Score!$Q$7:$Q$250)+SUMIF(Score!$W$7:$W$250,B42,Score!$X$7:$X$250)","v":0},null,null,{"$f":"SUMIF(Score!$F$7:$F$250,B42,Score!$G$7:$G$250)+SUMIF(Score!$I$7:$I$250,B42,Score!$H$7:$H$250)+SUMIF(Score!$T$7:$T$250,B42,Score!$U$7:$U$250)+SUMIF(Score!$W$7:$W$250,B42,Score!$V$7:$V$250)","v":0},{"$f":"SUMIF(Score!$F$7:$F$250,B42,Score!$H$7:$H$250)+SUMIF(Score!$I$7:$I$250,B42,Score!$G$7:$G$250)+SUMIF(Score!$T$7:$T$250,B42,Score!$V$7:$V$250)+SUMIF(Score!$W$7:$W$250,B42,Score!$U$7:$U$250)","v":0},0]
[null,"Sheffield United",15,-15,15,{"$f":"SUMIF(Score!$F$7:$F$250,B43,Score!$B$7:$B$250)+SUMIF(Score!$I$7:$I$250,B43,Score!$M$7:$M$250)+SUMIF(Score!$T$7:$T$250,B43,Score!$P$7:$P$250)+SUMIF(Score!$W$7:$W$250,B43,Score!$AA$7:$AA$250)","v":0},"Sheffield United",{"$f":"SUMIF(Score!$F$7:$F$250,B43,Score!$C$7:$C$250)+SUMIF(Score!$I$7:$I$250,B43,Score!$J$7:$J$250)+SUMIF(Score!$T$7:$T$250,B43,Score!$Q$7:$Q$250)+SUMIF(Score!$W$7:$W$250,B43,Score!$X$7:$X$250)","v":0},null,null,{"$f":"SUMIF(Score!$F$7:$F$250,B43,Score!$G$7:$G$250)+SUMIF(Score!$I$7:$I$250,B43,Score!$H$7:$H$250)+SUMIF(Score!$T$7:$T$250,B43,Score!$U$7:$U$250)+SUMIF(Score!$W$7:$W$250,B43,Score!$V$7:$V$250)","v":0},{"$f":"SUMIF(Score!$F$7:$F$250,B43,Score!$H$7:$H$250)+SUMIF(Score!$I$7:$I$250,B43,Score!$G$7:$G$250)+SUMIF(Score!$T$7:$T$250,B43,Score!$V$7:$V$250)+SUMIF(Score!$W$7:$W$250,B43,Score!$U$7:$U$250)","v":0},0]
[null,"Southampton",16,-16,16,{"$f":"SUMIF(Score!$F$7:$F$250,B44,Score!$B$7:$B$250)+SUMIF(Score!$I$7:$I$250,B44,Score!$M$7:$M$250)+SUMIF(Score!$T$7:$T$250,B44,Score!$P$7:$P$250)+SUMIF(Score!$W$7:$W$250,B44,Score!$AA$7:$AA$250)","v":0},"Southampton",{"$f":"SUMIF(Score!$F$7:$F$250,B44,Score!$C$7:$C$250)+SUMIF(Score!$I$7:$I$250,B44,Score!$J$7:$J$250)+SUMIF(Score!$T$7:$T$250,B44,Score!$Q$7:$Q$250)+SUMIF(Score!$W$7:$W$250,B44,Score!$X$7:$X$250)","v":0},null,null,{"$f":"SUMIF(Score!$F$7:$F$250,B44,Score!$G$7:$G$250)+SUMIF(Score!$I$7:$I$250,B44,Score!$H$7:$H$250)+SUMIF(Score!$T$7:$T$250,B44,Score!$U$7:$U$250)+SUMIF(Score!$W$7:$W$250,B44,Score!$V$7:$V$250)","v":0},{"$f":"SUMIF(Score!$F$7:$F$250,B44,Score!$H$7:$H$250)+SUMIF(Score!$I$7:$I$250,B44,Score!$G$7:$G$250)+SUMIF(Score!$T$7:$T$250,B44,Score!$V$7:$V$250)+SUMIF(Score!$W$7:$W$250,B44,Score!$U$7:$U$250)","v":0},0]
[null,"Tottenham",17,-17,17,{"$f":"SUMIF(Score!$F$7:$F$250,B45,Score!$B$7:$B$250)+SUMIF(Score!$I$7:$I$250,B45,Score!$M$7:$M$250)+SUMIF(Score!$T$7:$T$250,B45,Score!$P$7:$P$250)+SUMIF(Score!$W$7:$W$250,B45,Score!$AA$7:$AA$250)","v":0},"Tottenham",{"$f":"SUMIF(Score!$F$7:$F$250,B45,Score!$C$7:$C$250)+SUMIF(Score!$I$7:$I$250,B45,Score!$J$7:$J$250)+SUMIF(Score!$T$7:$T$250,B45,Score!$Q$7:$Q$250)+SUMIF(Score!$W$7:$W$250,B45,Score!$X$7:$X$250)","v":0},null,null,{"$f":"SUMIF(Score!$F$7:$F$250,B45,Score!$G$7:$G$250)+SUMIF(Score!$I$7:$I$250,B45,Score!$H$7:$H$250)+SUMIF(Score!$T$7:$T$250,B45,Score!$U$7:$U$250)+SUMIF(Score!$W$7:$W$250,B45,Score!$V$7:$V$250)","v":0},{"$f":"SUMIF(Score!$F$7:$F$250,B45,Score!$H$7:$H$250)+SUMIF(Score!$I$7:$I$250,B45,Score!$G$7:$G$250)+SUMIF(Score!$T$7:$T$250,B45,Score!$V$7:$V$250)+SUMIF(Score!$W$7:$W$250,B45,Score!$U$7:$U$250)","v":0},0]
[null,"Watford",18,-18,18,{"$f":"SUMIF(Score!$F$7:$F$250,B46,Score!$B$7:$B$250)+SUMIF(Score!$I$7:$I$250,B46,Score!$M$7:$M$250)+SUMIF(Score!$T$7:$T$250,B46,Score!$P$7:$P$250)+SUMIF(Score!$W$7:$W$250,B46,Score!$AA$7:$AA$250)","v":0},"Watford",{"$f":"SUMIF(Score!$F$7:$F$250,B46,Score!$C$7:$C$250)+SUMIF(Score!$I$7:$I$250,B46,Score!$J$7:$J$250)+SUMIF(Score!$T$7:$T$250,B46,Score!$Q$7:$Q$250)+SUMIF(Score!$W$7:$W$250,B46,Score!$X$7:$X$250)","v":0},null,null,{"$f":"SUMIF(Score!$F$7:$F$250,B46,Score!$G$7:$G$250)+SUMIF(Score!$I$7:$I$250,B46,Score!$H$7:$H$250)+SUMIF(Score!$T$7:$T$250,B46,Score!$U$7:$U$250)+SUMIF(Score!$W$7:$W$250,B46,Score!$V$7:$V$250)","v":0},{"$f":"SUMIF(Score!$F$7:$F$250,B46,Score!$H$7:$H$250)+SUMIF(Score!$I$7:$I$250,B46,Score!$G$7:$G$250)+SUMIF(Score!$T$7:$T$250,B46,Score!$V$7:$V$250)+SUMIF(Score!$W$7:$W$250,B46,Score!$U$7:$U$250)","v":0},0]
[null,"West Ham",19,-19,19,{"$f":"SUMIF(Score!$F$7:$F$250,B47,Score!$B$7:$B$250)+SUMIF(Score!$I$7:$I$250,B47,Score!$M$7:$M$250)+SUMIF(Score!$T$7:$T$250,B47,Score!$P$7:$P$250)+SUMIF(Score!$W$7:$W$250,B47,Score!$AA$7:$AA$250)","v":0},"West Ham",{"$f":"SUMIF(Score!$F$7:$F$250,B47,Score!$C$7:$C$250)+SUMIF(Score!$I$7:$I$250,B47,Score!$J$7:$J$250)+SUMIF(Score!$T$7:$T$250,B47,Score!$Q$7:$Q$250)+SUMIF(Score!$W$7:$W$250,B47,Score!$X$7:$X$250)","v":0},null,null,{"$f":"SUMIF(Score!$F$7:$F$250,B47,Score!$G$7:$G$250)+SUMIF(Score!$I$7:$I$250,B47,Score!$H$7:$H$250)+SUMIF(Score!$T$7:$T$250,B47,Score!$U$7:$U$250)+SUMIF(Score!$W$7:$W$250,B47,Score!$V$7:$V$250)","v":0},{"$f":"SUMIF(Score!$F$7:$F$250,B47,Score!$H$7:$H$250)+SUMIF(Score!$I$7:$I$250,B47,Score!$G$7:$G$250)+SUMIF(Score!$T$7:$T$250,B47,Score!$V$7:$V$250)+SUMIF(Score!$W$7:$W$250,B47,Score!$U$7:$U$250)","v":0},0]
[null,"Wolverhampton",20,-20,20,{"$f":"SUMIF(Score!$F$7:$F$250,B48,Score!$B$7:$B$250)+SUMIF(Score!$I$7:$I$250,B48,Score!$M$7:$M$250)+SUMIF(Score!$T$7:$T$250,B48,Score!$P$7:$P$250)+SUMIF(Score!$W$7:$W$250,B48,Score!$AA$7:$AA$250)","v":0},"Wolverhampton",{"$f":"SUMIF(Score!$F$7:$F$250,B48,Score!$C$7:$C$250)+SUMIF(Score!$I$7:$I$250,B48,Score!$J$7:$J$250)+SUMIF(Score!$T$7:$T$250,B48,Score!$Q$7:$Q$250)+SUMIF(Score!$W$7:$W$250,B48,Score!$X$7:$X$250)","v":0},null,null,{"$f":"SUMIF(Score!$F$7:$F$250,B48,Score!$G$7:$G$250)+SUMIF(Score!$I$7:$I$250,B48,Score!$H$7:$H$250)+SUMIF(Score!$T$7:$T$250,B48,Score!$U$7:$U$250)+SUMIF(Score!$W$7:$W$250,B48,Score!$V$7:$V$250)","v":0},{"$f":"SUMIF(Score!$F$7:$F$250,B48,Score!$H$7:$H$250)+SUMIF(Score!$I$7:$I$250,B48,Score!$G$7:$G$250)+SUMIF(Score!$T$7:$T$250,B48,Score!$V$7:$V$250)+SUMIF(Score!$W$7:$W$250,B48,Score!$U$7:$U$250)","v":0},0]
[]
[{"$f":"VLOOKUP(B50,$B$29:$C$48,2,FALSE)","v":1},{"$f":"VLOOKUP(D50,$E$29:$G$48,3,FALSE)","v":"Arsenal"},null,1]
[2,"Aston Villa",null,2]
[3,"Bournemouth",null,3]
[4,"Brighton",null,4]
[5,"Burnley",null,5]
[6,"Chelsea",null,6]
[7,"Crystal Palace",null,7]
[8,"Everton",null,8]
[9,"Leicester City",null,9]
[10,"Liverpool",null,10]
[11,"Manchester City",null,11]
[12,"Manchester United",null,12]
[13,"Newcastle",null,13]
[14,"Norwich",null,14]
[15,"Sheffield United",null,15]
[16,"Southampton",null,16]
[17,"Tottenham",null,17]
[18,"Watford",null,18]
[19,"West Ham",null,19]
[20,"Wolverhampton",null,20]

{"sheet":"Points","index":3,"n_rows":550,"n_cols":17,"rows_kept":550,"merged":[[1,4,2,5],[1,6,1,9],[1,10,1,12],[1,14,1,16],[2,10,2,11],[2,14,2,16],[5,0,14,0],[15,0,24,0],[25,0,34,0],[35,0,44,0],[45,0,54,0],[55,0,64,0],[65,0,74,0],[75,0,84,0],[85,0,94,0],[95,0,104,0],[105,0,114,0],[115,0,124,0],[125,0,134,0],[135,0,144,0],[145,0,154,0],[155,0,164,0],[165,0,174,0],[175,0,184,0],[185,0,194,0],[195,0,204,0],[205,0,214,0],[215,0,224,0],[225,0,234,0],[235,0,244,0],[245,0,254,0],[255,0,264,0],[265,0,274,0],[275,0,284,0],[285,0,294,0],[295,0,304,0],[305,0,314,0],[315,0,324,0],[325,0,334,0],[335,0,344,0],[345,0,354,0],[355,0,364,0],[365,0,374,0],[375,0,384,0],[393,1,403,1],[406,1,410,1],[411,1,421,1],[424,1,428,1]]}
[{"$f":"NOW()-0.077","v":"2019-07-26T09:56:51.820"},1]
[13,{"$f":"MAX(O387:XFD387)","v":1},null,null,"SCORE",null,"COTES"]
[null,{"$f":"MIN(IF($A$6:$A$65>$A$1,$B$6:$B$65))","v":0},{"$nulls":4},1,"N",2,"G",{"$f":"IF($K$4<>0,HLOOKUP(CONCATENATE($K$4,\"2\"),$O$4:$XFD390,387,FALSE),\"\")","v":""},null,{"$f":"IF($K$4<>0,VLOOKUP(K2,INDIRECT(CONCATENATE(\"Classement!D7:BD\",6+B2)),53,FALSE),\"\")","v":""},null,{"$f":"SUM(Q6:Q385)+Q478+Q439","v":0}]
[{"$nulls":10},{"$f":"K2","v":0},{"$f":"CONCATENATE(K4,\"1\")","v":"01"},{"$f":"CONCATENATE(K4,\"2\")","v":"02"},null,{"$f":"IF(O2<>\"\",O2,\"\")","v":""},{"$f":"CONCATENATE(O4,\"1\")","v":"1"},{"$f":"CONCATENATE(O4,\"2\")","v":"2"}]
[{"$nulls":10},{"$f":"HLOOKUP(K4,$O$4:$XFD5,2,FALSE)","v":{"$error":"#N/A"}}]
["JOURNEE n°1",null,{"$f":"Score!F7","v":"Liverpool"},{"$f":"Score!I7","v":"Norwich"},{"$f":"IF(Score!G7<>\"\",Score!G7,\"\")","v":""},{"$f":"IF(Score!H7<>\"\",Score!H7,\"\")","v":""},3.1,3,2.1,{"$f":"IF(OR(E6=\"\",F6=\"\"),\"\",IF(E6>F6,G6,IF(E6=F6,H6,I6)))","v":""},{"$f":"IF($K$4<>0,HLOOKUP($K$4,$O$4:$XFD6,ROW()-3,FALSE),\"\")","v":""},{"$f":"IF($K$4<>0,HLOOKUP(CONCATENATE($K$4,\"1\"),$O$4:$XFD6,ROW()-3,FALSE),\"\")","v":""},{"$f":"IF($K$4<>0,HLOOKUP(CONCATENATE($K$4,\"2\"),$O$4:$XFD6,ROW()-3,FALSE),\"\")","v":""},{"$nulls":3},{"$f":"IF(OR($E6=\"\",$F6=\"\",O6=\"\",P6=\"\"),\"\",IF(AND(O6=$E6,P6=$F6),Reglement!$S$3*$J6,IF(SIGN($E6-$F6)=SIGN(O6-P6),Reglement!$S$4*$J6,0))*IF(AND($E6+$F6>=6,O6+P6>=6),Reglement!$S$29,IF(AND($E6+$F6>=4,O6+P6>=4),Reglement!$S$28,1)))","v":""}]
[null,null,{"$f":"Score!F8","v":"West Ham"},{"$f":"Score!I8","v":"Manchester City"},{"$f":"IF(Score!G8<>\"\",Score!G8,\"\")","v":""},{"$f":"IF(Score!H8<>\"\",Score!H8,\"\")","v":""},1.5,3.6,5.6,"",{"$f":"IF($K$4<>0,HLOOKUP($K$4,$O$4:$XFD7,ROW()-3,FALSE),\"\")","v":""},{"$f":"IF($K$4<>0,HLOOKUP(CONCATENATE($K$4,\"1\"),$O$4:$XFD7,ROW()-3,FALSE),\"\")","v":""},{"$f":"IF($K$4<>0,HLOOKUP(CONCATENATE($K$4,\"2\"),$O$4:$XFD7,ROW()-3,FALSE),\"\")","v":""},{"$nulls":3},{"$f":"IF(OR($E7=\"\",$F7=\"\",O7=\"\",P7=\"\"),\"\",IF(AND(O7=$E7,P7=$F7),Reglement!$S$3*$J7,IF(SIGN($E7-$F7)=SIGN(O7-P7),Reglement!$S$4*$J7,0))*IF(AND($E7+$F7>=6,O7+P7>=6),Reglement!$S$29,IF(AND($E7+$F7>=4,O7+P7>=4),Reglement!$S$28,1)))","v":""}]
[null,null,{"$f":"Score!F9","v":"Bournemouth"},{"$f":"Score!I9","v":"Sheffield United"},{"$f":"IF(Score!G9<>\"\",Score!G9,\"\")","v":""},{"$f":"IF(Score!H9<>\"\",Score!H9,\"\")","v":""},1.8,3.2,4.1,"",{"$f":"IF($K$4<>0,HLOOKUP($K$4,$O$4:$XFD8,ROW()-3,FALSE),\"\")","v":""},{"$f":"IF($K$4<>0,HLOOKUP(CONCATENATE($K$4,\"1\"),$O$4:$XFD8,ROW()-3,FALSE),\"\")","v":""},{"$f":"IF($K$4<>0,HLOOKUP(CONCATENATE($K$4,\"2\"),$O$4:$XFD8,ROW()-3,FALSE),\"\")","v":""},{"$nulls":3},{"$f":"IF(OR($E8=\"\",$F8=\"\",O8=\"\",P8=\"\"),\"\",IF(AND(O8=$E8,P8=$F8),Reglement!$S$3*$J8,IF(SIGN($E8-$F8)=SIGN(O8-P8),Reglement!$S$4*$J8,0))*IF(AND($E8+$F8>=6,O8+P8>=6),Reglement!$S$29,IF(AND($E8+$F8>=4,O8+P8>=4),Reglement!$S$28,1)))","v":""}]
[null,null,{"$f":"Score!F10","v":"Burnley"},{"$f":"Score!I10","v":"Southampton"},{"$f":"IF(Score!G10<>\"\",Score!G10,\"\")","v":""},{"$f":"IF(Score!H10<>\"\",Score!H10,\"\")","v":""},2,3.1,3.3,"",{"$f":"IF($K$4<>0,HLOOKUP($K$4,$O$4:$XFD9,ROW()-3,FALSE),\"\")","v":""},{"$f":"IF($K$4<>0,HLOOKUP(CONCATENATE($K$4,\"1\"),$O$4:$XFD9,ROW()-3,FALSE),\"\")","v":""},{"$f":"IF($K$4<>0,HLOOKUP(CONCATENATE($K$4,\"2\"),$O$4:$XFD9,ROW()-3,FALSE),\"\")","v":""},{"$nulls":3},{"$f":"IF(OR($E9=\"\",$F9=\"\",O9=\"\",P9=\"\"),\"\",IF(AND(O9=$E9,P9=$F9),Reglement!$S$3*$J9,IF(SIGN($E9-$F9)=SIGN(O9-P9),Reglement!$S$4*$J9,0))*IF(AND($E9+$F9>=6,O9+P9>=6),Reglement!$S$29,IF(AND($E9+$F9>=4,O9+P9>=4),Reglement!$S$28,1)))","v":""}]
[null,null,{"$f":"Score!F11","v":"Crystal Palace"},{"$f":"Score!I11","v":"Everton"},{"$f":"IF(Score!G11<>\"\",Score!G11,\"\")","v":""},{"$f":"IF(Score!H11<>\"\",Score!H11,\"\")","v":""},2.1,3,3.1,"",{"$f":"IF($K$4<>0,HLOOKUP($K$4,$O$4:$XFD10,ROW()-3,FALSE),\"\")","v":""},{"$f":"IF($K$4<>0,HLOOKUP(CONCATENATE($K$4,\"1\"),$O$4:$XFD10,ROW()-3,FALSE),\"\")","v":""},{"$f":"IF($K$4<>0,HLOOKUP(CONCATENATE($K$4,\"2\"),$O$4:$XFD10,ROW()-3,FALSE),\"\")","v":""},{"$nulls":3},{"$f":"IF(OR($E10=\"\",$F10=\"\",O10=\"\",P10=\"\"),\"\",IF(AND(O10=$E10,P10=$F10),Reglement!$S$3*$J10,IF(SIGN($E10-$F10)=SIGN(O10-P10),Reglement!$S$4*$J10,0))*IF(AND($E10+$F10>=6,O10+P10>=6),Reglement!$S$29,IF(AND($E10+$F10>=4,O10+P10>=4),Reglement!$S$28,1)))","v":""}]
[null,null,{"$f":"Score!F12","v":"Watford"},{"$f":"Score!I12","v":"Brighton"},{"$f":"IF(Score!G12<>\"\",Score!G12,\"\")","v":""},{"$f":"IF(Score!H12<>\"\",Score!H12,\"\")","v":""},2.3,2.9,2.8,"",{"$f":"IF($K$4<>0,HLOOKUP($K$4,$O$4:$XFD11,ROW()-3,FALSE),\"\")","v":""},{"$f":"IF($K$4<>0,HLOOKUP(CONCATENATE($K$4,\"1\"),$O$4:$XFD11,ROW()-3,FALSE),\"\")","v":""},{"$f":"IF($K$4<>0,HLOOKUP(CONCATENATE($K$4,\"2\"),$O$4:$XFD11,ROW()-3,FALSE),\"\")","v":""},{"$nulls":3},{"$f":"IF(OR($E11=\"\",$F11=\"\",O11=\"\",P11=\"\"),\"\",IF(AND(O11=$E11,P11=$F11),Reglement!$S$3*$J11,IF(SIGN($E11-$F11)=SIGN(O11-P11),Reglement!$S$4*$J11,0))*IF(AND($E11+$F11>=6,O11+P11>=6),Reglement!$S$29,IF(AND($E11+$F11>=4,O11+P11>=4),Reglement!$S$28,1)))","v":""}]
[null,null,{"$f":"Score!F13","v":"Tottenham"},{"$f":"Score!I13","v":"Aston Villa"},{"$f":"IF(Score!G13<>\"\",Score!G13,\"\")","v":""},{"$f":"IF(Score!H13<>\"\",Score!H13,\"\")","v":""},1.7,3.3,4.1,"",{"$f":"IF($K$4<>0,HLOOKUP($K$4,$O$4:$XFD12,ROW()-3,FALSE),\"\")","v":""},{"$f":"IF($K$4<>0,HLOOKUP(CONCATENATE($K$4,\"1\"),$O$4:$XFD12,ROW()-3,FALSE),\"\")","v":""},{"$f":"IF($K$4<>0,HLOOKUP(CONCATENATE($K$4,\"2\"),$O$4:$XFD12,ROW()-3,FALSE),\"\")","v":""},{"$nulls":3},{"$f":"IF(OR($E12=\"\",$F12=\"\",O12=\"\",P12=\"\"),\"\",IF(AND(O12=$E12,P12=$F12),Reglement!$S$3*$J12,IF(SIGN($E12-$F12)=SIGN(O12-P12),Reglement!$S$4*$J12,0))*IF(AND($E12+$F12>=6,O12+P12>=6),Reglement!$S$29,IF(AND($E12+$F12>=4,O12+P12>=4),Reglement!$S$28,1)))","v":""}]
[null,null,{"$f":"Score!F14","v":"Leicester City"},{"$f":"Score!I14","v":"Wolverhampton"},{"$f":"IF(Score!G14<>\"\",Score!G14,\"\")","v":""},{"$f":"IF(Score!H14<>\"\",Score!H14,\"\")","v":""},1,7.5,16,"",{"$f":"IF($K$4<>0,HLOOKUP($K$4,$O$4:$XFD13,ROW()-3,FALSE),\"\")","v":""},{"$f":"IF($K$4<>0,HLOOKUP(CONCATENATE($K$4,\"1\"),$O$4:$XFD13,ROW()-3,FALSE),\"\")","v":""},{"$f":"IF($K$4<>0,HLOOKUP(CONCATENATE($K$4,\"2\"),$O$4:$XFD13,ROW()-3,FALSE),\"\")","v":""},{"$nulls":3},{"$f":"IF(OR($E13=\"\",$F13=\"\",O13=\"\",P13=\"\"),\"\",IF(AND(O13=$E13,P13=$F13),Reglement!$S$3*$J13,IF(SIGN($E13-$F13)=SIGN(O13-P13),Reglement!$S$4*$J13,0))*IF(AND($E13+$F13>=6,O13+P13>=6),Reglement!$S$29,IF(AND($E13+$F13>=4,O13+P13>=4),Reglement!$S$28,1)))","v":""}]
[null,null,{"$f":"Score!F15","v":"Newcastle"},{"$f":"Score!I15","v":"Arsenal"},{"$f":"IF(Score!G15<>\"\",Score!G15,\"\")","v":""},{"$f":"IF(Score!H15<>\"\",Score!H15,\"\")","v":""},2.2,2.9,3,"",{"$f":"IF($K$4<>0,HLOOKUP($K$4,$O$4:$XFD14,ROW()-3,FALSE),\"\")","v":""},{"$f":"IF($K$4<>0,HLOOKUP(CONCATENATE($K$4,\"1\"),$O$4:$XFD14,ROW()-3,FALSE),\"\")","v":""},{"$f":"IF($K$4<>0,HLOOKUP(CONCATENATE($K$4,\"2\"),$O$4:$XFD14,ROW()-3,FALSE),\"\")","v":""},{"$nulls":3},{"$f":"IF(OR($E14=\"\",$F14=\"\",O14=\"\",P14=\"\"),\"\",IF(AND(O14=$E14,P14=$F14),Reglement!$S$3*$J14,IF(SIGN($E14-$F14)=SIGN(O14-P14),Reglement!$S$4*$J14,0))*IF(AND($E14+$F14>=6,O14+P14>=6),Reglement!$S$29,IF(AND($E14+$F14>=4,O14+P14>=4),Reglement!$S$28,1)))","v":""}]
[null,null,{"$f":"Score!F16","v":"Manchester United"},{"$f":"Score!I16","v":"Chelsea"},{"$f":"IF(Score!G16<>\"\",Score!G16,\"\")","v":""},{"$f":"IF(Score!H16<>\"\",Score!H16,\"\")","v":""},2.7,3.1,2.3,"",{"$f":"IF($K$4<>0,HLOOKUP($K$4,$O$4:$XFD15,ROW()-3,FALSE),\"\")","v":""},{"$f":"IF($K$4<>0,HLOOKUP(CONCATENATE($K$4,\"1\"),$O$4:$XFD15,ROW()-3,FALSE),\"\")","v":""},{"$f":"IF($K$4<>0,HLOOKUP(CONCATENATE($K$4,\"2\"),$O$4:$XFD15,ROW()-3,FALSE),\"\")","v":""},{"$nulls":3},{"$f":"IF(OR($E15=\"\",$F15=\"\",O15=\"\",P15=\"\"),\"\",IF(AND(O15=$E15,P15=$F15),Reglement!$S$3*$J15,IF(SIGN($E15-$F15)=SIGN(O15-P15),Reglement!$S$4*$J15,0))*IF(AND($E15+$F15>=6,O15+P15>=6),Reglement!$S$29,IF(AND($E15+$F15>=4,O15+P15>=4),Reglement!$S$28,1)))","v":""}]
["JOURNEE n°2",null,{"$f":"Score!F20","v":"Arsenal"},{"$f":"Score!I20","v":"Burnley"},{"$f":"IF(Score!G20<>\"\",Score!G20,\"\")","v":""},{"$f":"IF(Score!H20<>\"\",Score!H20,\"\")","v":""},1,1,1,{"$f":"IF(OR(E16=\"\",F16=\"\"),\"\",IF(E16>F16,G16,IF(E16=F16,H16,I16)))","v":""},{"$f":"IF($K$4<>0,HLOOKUP($K$4,$O$4:$XFD16,ROW()-3,FALSE),\"\")","v":""},{"$f":"IF($K$4<>0,HLOOKUP(CONCATENATE($K$4,\"1\"),$O$4:$XFD16,ROW()-3,FALSE),\"\")","v":""},{"$f":"IF($K$4<>0,HLOOKUP(CONCATENATE($K$4,\"2\"),$O$4:$XFD16,ROW()-3,FALSE),\"\")","v":""},{"$nulls":3},{"$f":"IF(OR($E16=\"\",$F16=\"\",O16=\"\",P16=\"\"),\"\",IF(AND(O16=$E16,P16=$F16),Reglement!$S$3*$J16,IF(SIGN($E16-$F16)=SIGN(O16-P16),Reglement!$S$4*$J16,0))*IF(AND($E16+$F16>=6,O16+P16>=6),Reglement!$S$29,IF(AND($E16+$F16>=4,O16+P16>=4),Reglement!$S$28,1)))","v":""}]
[null,null,{"$f":"Score!F21","v":"Aston Villa"},{"$f":"Score!I21","v":"Bournemouth"},{"$f":"IF(Score!G21<>\"\",Score!G21,\"\")","v":""},{"$f":"IF(Score!H21<>\"\",Score!H21,\"\")","v":""},1,1,1,"",{"$f":"IF($K$4<>0,HLOOKUP($K$4,$O$4:$XFD17,ROW()-3,FALSE),\"\")","v":""},{"$f":"IF($K$4<>0,HLOOKUP(CONCATENATE($K$4,\"1\"),$O$4:$XFD17,ROW()-3,FALSE),\"\")","v":""},{"$f":"IF($K$4<>0,HLOOKUP(CONCATENATE($K$4,\"2\"),$O$4:$XFD17,ROW()-3,FALSE),\"\")","v":""},{"$nulls":3},{"$f":"IF(OR($E17=\"\",$F17=\"\",O17=\"\",P17=\"\"),\"\",IF(AND(O17=$E17,P17=$F17),Reglement!$S$3*$J17,IF(SIGN($E17-$F17)=SIGN(O17-P17),Reglement!$S$4*$J17,0))*IF(AND($E17+$F17>=6,O17+P17>=6),Reglement!$S$29,IF(AND($E17+$F17>=4,O17+P17>=4),Reglement!$S$28,1)))","v":""}]
[null,null,{"$f":"Score!F22","v":"Brighton"},{"$f":"Score!I22","v":"West Ham"},{"$f":"IF(Score!G22<>\"\",Score!G22,\"\")","v":""},{"$f":"IF(Score!H22<>\"\",Score!H22,\"\")","v":""},1,1,1,"",{"$f":"IF($K$4<>0,HLOOKUP($K$4,$O$4:$XFD18,ROW()-3,FALSE),\"\")","v":""},{"$f":"IF($K$4<>0,HLOOKUP(CONCATENATE($K$4,\"1\"),$O$4:$XFD18,ROW()-3,FALSE),\"\")","v":""},{"$f":"IF($K$4<>0,HLOOKUP(CONCATENATE($K$4,\"2\"),$O$4:$XFD18,ROW()-3,FALSE),\"\")","v":""},{"$nulls":3},{"$f":"IF(OR($E18=\"\",$F18=\"\",O18=\"\",P18=\"\"),\"\",IF(AND(O18=$E18,P18=$F18),Reglement!$S$3*$J18,IF(SIGN($E18-$F18)=SIGN(O18-P18),Reglement!$S$4*$J18,0))*IF(AND($E18+$F18>=6,O18+P18>=6),Reglement!$S$29,IF(AND($E18+$F18>=4,O18+P18>=4),Reglement!$S$28,1)))","v":""}]
[null,null,{"$f":"Score!F23","v":"Chelsea"},{"$f":"Score!I23","v":"Leicester City"},{"$f":"IF(Score!G23<>\"\",Score!G23,\"\")","v":""},{"$f":"IF(Score!H23<>\"\",Score!H23,\"\")","v":""},1,1,1,"",{"$f":"IF($K$4<>0,HLOOKUP($K$4,$O$4:$XFD19,ROW()-3,FALSE),\"\")","v":""},{"$f":"IF($K$4<>0,HLOOKUP(CONCATENATE($K$4,\"1\"),$O$4:$XFD19,ROW()-3,FALSE),\"\")","v":""},{"$f":"IF($K$4<>0,HLOOKUP(CONCATENATE($K$4,\"2\"),$O$4:$XFD19,ROW()-3,FALSE),\"\")","v":""},{"$nulls":3},{"$f":"IF(OR($E19=\"\",$F19=\"\",O19=\"\",P19=\"\"),\"\",IF(AND(O19=$E19,P19=$F19),Reglement!$S$3*$J19,IF(SIGN($E19-$F19)=SIGN(O19-P19),Reglement!$S$4*$J19,0))*IF(AND($E19+$F19>=6,O19+P19>=6),Reglement!$S$29,IF(AND($E19+$F19>=4,O19+P19>=4),Reglement!$S$28,1)))","v":""}]
[null,null,{"$f":"Score!F24","v":"Everton"},{"$f":"Score!I24","v":"Watford"},{"$f":"IF(Score!G24<>\"\",Score!G24,\"\")","v":""},{"$f":"IF(Score!H24<>\"\",Score!H24,\"\")","v":""},1,1,1,"",{"$f":"IF($K$4<>0,HLOOKUP($K$4,$O$4:$XFD20,ROW()-3,FALSE),\"\")","v":""},{"$f":"IF($K$4<>0,HLOOKUP(CONCATENATE($K$4,\"1\"),$O$4:$XFD20,ROW()-3,FALSE),\"\")","v":""},{"$f":"IF($K$4<>0,HLOOKUP(CONCATENATE($K$4,\"2\"),$O$4:$XFD20,ROW()-3,FALSE),\"\")","v":""},{"$nulls":3},{"$f":"IF(OR($E20=\"\",$F20=\"\",O20=\"\",P20=\"\"),\"\",IF(AND(O20=$E20,P20=$F20),Reglement!$S$3*$J20,IF(SIGN($E20-$F20)=SIGN(O20-P20),Reglement!$S$4*$J20,0))*IF(AND($E20+$F20>=6,O20+P20>=6),Reglement!$S$29,IF(AND($E20+$F20>=4,O20+P20>=4),Reglement!$S$28,1)))","v":""}]
[null,null,{"$f":"Score!F25","v":"Manchester City"},{"$f":"Score!I25","v":"Tottenham"},{"$f":"IF(Score!G25<>\"\",Score!G25,\"\")","v":""},{"$f":"IF(Score!H25<>\"\",Score!H25,\"\")","v":""},1,1,1,"",{"$f":"IF($K$4<>0,HLOOKUP($K$4,$O$4:$XFD21,ROW()-3,FALSE),\"\")","v":""},{"$f":"IF($K$4<>0,HLOOKUP(CONCATENATE($K$4,\"1\"),$O$4:$XFD21,ROW()-3,FALSE),\"\")","v":""},{"$f":"IF($K$4<>0,HLOOKUP(CONCATENATE($K$4,\"2\"),$O$4:$XFD21,ROW()-3,FALSE),\"\")","v":""},{"$nulls":3},{"$f":"IF(OR($E21=\"\",$F21=\"\",O21=\"\",P21=\"\"),\"\",IF(AND(O21=$E21,P21=$F21),Reglement!$S$3*$J21,IF(SIGN($E21-$F21)=SIGN(O21-P21),Reglement!$S$4*$J21,0))*IF(AND($E21+$F21>=6,O21+P21>=6),Reglement!$S$29,IF(AND($E21+$F21>=4,O21+P21>=4),Reglement!$S$28,1)))","v":""}]
[null,null,{"$f":"Score!F26","v":"Norwich"},{"$f":"Score!I26","v":"Newcastle"},{"$f":"IF(Score!G26<>\"\",Score!G26,\"\")","v":""},{"$f":"IF(Score!H26<>\"\",Score!H26,\"\")","v":""},1,1,1,{"$f":"IF(OR(E22=\"\",F22=\"\"),\"\",IF(E22>F22,G22,IF(E22=F22,H22,I22)))","v":""},{"$f":"IF($K$4<>0,HLOOKUP($K$4,$O$4:$XFD22,ROW()-3,FALSE),\"\")","v":""},{"$f":"IF($K$4<>0,HLOOKUP(CONCATENATE($K$4,\"1\"),$O$4:$XFD22,ROW()-3,FALSE),\"\")","v":""},{"$f":"IF($K$4<>0,HLOOKUP(CONCATENATE($K$4,\"2\"),$O$4:$XFD22,ROW()-3,FALSE),\"\")","v":""},{"$nulls":3},{"$f":"IF(OR($E22=\"\",$F22=\"\",O22=\"\",P22=\"\"),\"\",IF(AND(O22=$E22,P22=$F22),Reglement!$S$3*$J22,IF(SIGN($E22-$F22)=SIGN(O22-P22),Reglement!$S$4*$J22,0))*IF(AND($E22+$F22>=6,O22+P22>=6),Reglement!$S$29,IF(AND($E22+$F22>=4,O22+P22>=4),Reglement!$S$28,1)))","v":""}]
[null,null,{"$f":"Score!F27","v":"Sheffield United"},{"$f":"Score!I27","v":"Crystal Palace"},{"$f":"IF(Score!G27<>\"\",Score!G27,\"\")","v":""},{"$f":"IF(Score!H27<>\"\",Score!H27,\"\")","v":""},1,1,1,"",{"$f":"IF($K$4<>0,HLOOKUP($K$4,$O$4:$XFD23,ROW()-3,FALSE),\"\")","v":""},{"$f":"IF($K$4<>0,HLOOKUP(CONCATENATE($K$4,\"1\"),$O$4:$XFD23,ROW()-3,FALSE),\"\")","v":""},{"$f":"IF($K$4<>0,HLOOKUP(CONCATENATE($K$4,\"2\"),$O$4:$XFD23,ROW()-3,FALSE),\"\")","v":""},{"$nulls":3},{"$f":"IF(OR($E23=\"\",$F23=\"\",O23=\"\",P23=\"\"),\"\",IF(AND(O23=$E23,P23=$F23),Reglement!$S$3*$J23,IF(SIGN($E23-$F23)=SIGN(O23-P23),Reglement!$S$4*$J23,0))*IF(AND($E23+$F23>=6,O23+P23>=6),Reglement!$S$29,IF(AND($E23+$F23>=4,O23+P23>=4),Reglement!$S$28,1)))","v":""}]
[null,null,{"$f":"Score!F28","v":"Southampton"},{"$f":"Score!I28","v":"Liverpool"},{"$f":"IF(Score!G28<>\"\",Score!G28,\"\")","v":""},{"$f":"IF(Score!H28<>\"\",Score!H28,\"\")","v":""},1,1,1,"",{"$f":"IF($K$4<>0,HLOOKUP($K$4,$O$4:$XFD24,ROW()-3,FALSE),\"\")","v":""},{"$f":"IF($K$4<>0,HLOOKUP(CONCATENATE($K$4,\"1\"),$O$4:$XFD24,ROW()-3,FALSE),\"\")","v":""},{"$f":"IF($K$4<>0,HLOOKUP(CONCATENATE($K$4,\"2\"),$O$4:$XFD24,ROW()-3,FALSE),\"\")","v":""},{"$nulls":3},{"$f":"IF(OR($E24=\"\",$F24=\"\",O24=\"\",P24=\"\"),\"\",IF(AND(O24=$E24,P24=$F24),Reglement!$S$3*$J24,IF(SIGN($E24-$F24)=SIGN(O24-P24),Reglement!$S$4*$J24,0))*IF(AND($E24+$F24>=6,O24+P24>=6),Reglement!$S$29,IF(AND($E24+$F24>=4,O24+P24>=4),Reglement!$S$28,1)))","v":""}]
[null,null,{"$f":"Score!F29","v":"Wolverhampton"},{"$f":"Score!I29","v":"Manchester United"},{"$f":"IF(Score!G29<>\"\",Score!G29,\"\")","v":""},{"$f":"IF(Score!H29<>\"\",Score!H29,\"\")","v":""},1,1,1,{"$f":"IF(OR(E25=\"\",F25=\"\"),\"\",IF(E25>F25,G25,IF(E25=F25,H25,I25)))","v":""},{"$f":"IF($K$4<>0,HLOOKUP($K$4,$O$4:$XFD25,ROW()-3,FALSE),\"\")","v":""},{"$f":"IF($K$4<>0,HLOOKUP(CONCATENATE($K$4,\"1\"),$O$4:$XFD25,ROW()-3,FALSE),\"\")","v":""},{"$f":"IF($K$4<>0,HLOOKUP(CONCATENATE($K$4,\"2\"),$O$4:$XFD25,ROW()-3,FALSE),\"\")","v":""},{"$nulls":3},{"$f":"IF(OR($E25=\"\",$F25=\"\",O25=\"\",P25=\"\"),\"\",IF(AND(O25=$E25,P25=$F25),Reglement!$S$3*$J25,IF(SIGN($E25-$F25)=SIGN(O25-P25),Reglement!$S$4*$J25,0))*IF(AND($E25+$F25>=6,O25+P25>=6),Reglement!$S$29,IF(AND($E25+$F25>=4,O25+P25>=4),Reglement!$S$28,1)))","v":""}]
["JOURNEE n°3",null,{"$f":"Score!F33","v":"Bournemouth"},{"$f":"Score!I33","v":"Manchester City"},{"$f":"IF(Score!G33<>\"\",Score!G33,\"\")","v":""},{"$f":"IF(Score!H33<>\"\",Score!H33,\"\")","v":""},1,1,1,"",{"$f":"IF($K$4<>0,HLOOKUP($K$4,$O$4:$XFD26,ROW()-3,FALSE),\"\")","v":""},{"$f":"IF($K$4<>0,HLOOKUP(CONCATENATE($K$4,\"1\"),$O$4:$XFD26,ROW()-3,FALSE),\"\")","v":""},{"$f":"IF($K$4<>0,HLOOKUP(CONCATENATE($K$4,\"2\"),$O$4:$XFD26,ROW()-3,FALSE),\"\")","v":""},{"$nulls":3},{"$f":"IF(OR($E26=\"\",$F26=\"\",O26=\"\",P26=\"\"),\"\",IF(AND(O26=$E26,P26=$F26),Reglement!$S$3*$J26,IF(SIGN($E26-$F26)=SIGN(O26-P26),Reglement!$S$4*$J26,0))*IF(AND($E26+$F26>=6,O26+P26>=6),Reglement!$S$29,IF(AND($E26+$F26>=4,O26+P26>=4),Reglement!$S$28,1)))","v":""}]
[null,null,{"$f":"Score!F34","v":"Aston Villa"},{"$f":"Score!I34","v":"Everton"},{"$f":"IF(Score!G34<>\"\",Score!G34,\"\")","v":""},{"$f":"IF(Score!H34<>\"\",Score!H34,\"\")","v":""},1,1,1,"",{"$f":"IF($K$4<>0,HLOOKUP($K$4,$O$4:$XFD27,ROW()-3,FALSE),\"\")","v":""},{"$f":"IF($K$4<>0,HLOOKUP(CONCATENATE($K$4,\"1\"),$O$4:$XFD27,ROW()-3,FALSE),\"\")","v":""},{"$f":"IF($K$4<>0,HLOOKUP(CONCATENATE($K$4,\"2\"),$O$4:$XFD27,ROW()-3,FALSE),\"\")","v":""},{"$nulls":3},{"$f":"IF(OR($E27=\"\",$F27=\"\",O27=\"\",P27=\"\"),\"\",IF(AND(O27=$E27,P27=$F27),Reglement!$S$3*$J27,IF(SIGN($E27-$F27)=SIGN(O27-P27),Reglement!$S$4*$J27,0))*IF(AND($E27+$F27>=6,O27+P27>=6),Reglement!$S$29,IF(AND($E27+$F27>=4,O27+P27>=4),Reglement!$S$28,1)))","v":""}]
[null,null,{"$f":"Score!F35","v":"Brighton"},{"$f":"Score!I35","v":"Southampton"},{"$f":"IF(Score!G35<>\"\",Score!G35,\"\")","v":""},{"$f":"IF(Score!H35<>\"\",Score!H35,\"\")","v":""},1,1,1,"",{"$f":"IF($K$4<>0,HLOOKUP($K$4,$O$4:$XFD28,ROW()-3,FALSE),\"\")","v":""},{"$f":"IF($K$4<>0,HLOOKUP(CONCATENATE($K$4,\"1\"),$O$4:$XFD28,ROW()-3,FALSE),\"\")","v":""},{"$f":"IF($K$4<>0,HLOOKUP(CONCATENATE($K$4,\"2\"),$O$4:$XFD28,ROW()-3,FALSE),\"\")","v":""},{"$nulls":3},{"$f":"IF(OR($E28=\"\",$F28=\"\",O28=\"\",P28=\"\"),\"\",IF(AND(O28=$E28,P28=$F28),Reglement!$S$3*$J28,IF(SIGN($E28-$F28)=SIGN(O28-P28),Reglement!$S$4*$J28,0))*IF(AND($E28+$F28>=6,O28+P28>=6),Reglement!$S$29,IF(AND($E28+$F28>=4,O28+P28>=4),Reglement!$S$28,1)))","v":""}]
[null,null,{"$f":"Score!F36","v":"Liverpool"},{"$f":"Score!I36","v":"Arsenal"},{"$f":"IF(Score!G36<>\"\",Score!G36,\"\")","v":""},{"$f":"IF(Score!H36<>\"\",Score!H36,\"\")","v":""},1,1,1,"",{"$f":"IF($K$4<>0,HLOOKUP($K$4,$O$4:$XFD29,ROW()-3,FALSE),\"\")","v":""},{"$f":"IF($K$4<>0,HLOOKUP(CONCATENATE($K$4,\"1\"),$O$4:$XFD29,ROW()-3,FALSE),\"\")","v":""},{"$f":"IF($K$4<>0,HLOOKUP(CONCATENATE($K$4,\"2\"),$O$4:$XFD29,ROW()-3,FALSE),\"\")","v":""},{"$nulls":3},{"$f":"IF(OR($E29=\"\",$F29=\"\",O29=\"\",P29=\"\"),\"\",IF(AND(O29=$E29,P29=$F29),Reglement!$S$3*$J29,IF(SIGN($E29-$F29)=SIGN(O29-P29),Reglement!$S$4*$J29,0))*IF(AND($E29+$F29>=6,O29+P29>=6),Reglement!$S$29,IF(AND($E29+$F29>=4,O29+P29>=4),Reglement!$S$28,1)))","v":""}]
[null,null,{"$f":"Score!F37","v":"Manchester United"},{"$f":"Score!I37","v":"Crystal Palace"},{"$f":"IF(Score!G37<>\"\",Score!G37,\"\")","v":""},{"$f":"IF(Score!H37<>\"\",Score!H37,\"\")","v":""},1,1,1,"",{"$f":"IF($K$4<>0,HLOOKUP($K$4,$O$4:$XFD30,ROW()-3,FALSE),\"\")","v":""},{"$f":"IF($K$4<>0,HLOOKUP(CONCATENATE($K$4,\"1\"),$O$4:$XFD30,ROW()-3,FALSE),\"\")","v":""},{"$f":"IF($K$4<>0,HLOOKUP(CONCATENATE($K$4,\"2\"),$O$4:$XFD30,ROW()-3,FALSE),\"\")","v":""},{"$nulls":3},{"$f":"IF(OR($E30=\"\",$F30=\"\",O30=\"\",P30=\"\"),\"\",IF(AND(O30=$E30,P30=$F30),Reglement!$S$3*$J30,IF(SIGN($E30-$F30)=SIGN(O30-P30),Reglement!$S$4*$J30,0))*IF(AND($E30+$F30>=6,O30+P30>=6),Reglement!$S$29,IF(AND($E30+$F30>=4,O30+P30>=4),Reglement!$S$28,1)))","v":""}]
[null,null,{"$f":"Score!F38","v":"Norwich"},{"$f":"Score!I38","v":"Chelsea"},{"$f":"IF(Score!G38<>\"\",Score!G38,\"\")","v":""},{"$f":"IF(Score!H38<>\"\",Score!H38,\"\")","v":""},1,1,1,"",{"$f":"IF($K$4<>0,HLOOKUP($K$4,$O$4:$XFD31,ROW()-3,FALSE),\"\")","v":""},{"$f":"IF($K$4<>0,HLOOKUP(CONCATENATE($K$4,\"1\"),$O$4:$XFD31,ROW()-3,FALSE),\"\")","v":""},{"$f":"IF($K$4<>0,HLOOKUP(CONCATENATE($K$4,\"2\"),$O$4:$XFD31,ROW()-3,FALSE),\"\")","v":""},{"$nulls":3},{"$f":"IF(OR($E31=\"\",$F31=\"\",O31=\"\",P31=\"\"),\"\",IF(AND(O31=$E31,P31=$F31),Reglement!$S$3*$J31,IF(SIGN($E31-$F31)=SIGN(O31-P31),Reglement!$S$4*$J31,0))*IF(AND($E31+$F31>=6,O31+P31>=6),Reglement!$S$29,IF(AND($E31+$F31>=4,O31+P31>=4),Reglement!$S$28,1)))","v":""}]
[null,null,{"$f":"Score!F39","v":"Sheffield United"},{"$f":"Score!I39","v":"Leicester City"},{"$f":"IF(Score!G39<>\"\",Score!G39,\"\")","v":""},{"$f":"IF(Score!H39<>\"\",Score!H39,\"\")","v":""},1,1,1,"",{"$f":"IF($K$4<>0,HLOOKUP($K$4,$O$4:$XFD32,ROW()-3,FALSE),\"\")","v":""},{"$f":"IF($K$4<>0,HLOOKUP(CONCATENATE($K$4,\"1\"),$O$4:$XFD32,ROW()-3,FALSE),\"\")","v":""},{"$f":"IF($K$4<>0,HLOOKUP(CONCATENATE($K$4,\"2\"),$O$4:$XFD32,ROW()-3,FALSE),\"\")","v":""},{"$nulls":3},{"$f":"IF(OR($E32=\"\",$F32=\"\",O32=\"\",P32=\"\"),\"\",IF(AND(O32=$E32,P32=$F32),Reglement!$S$3*$J32,IF(SIGN($E32-$F32)=SIGN(O32-P32),Reglement!$S$4*$J32,0))*IF(AND($E32+$F32>=6,O32+P32>=6),Reglement!$S$29,IF(AND($E32+$F32>=4,O32+P32>=4),Reglement!$S$28,1)))","v":""}]
[null,null,{"$f":"Score!F40","v":"Tottenham"},{"$f":"Score!I40","v":"Newcastle"},{"$f":"IF(Score!G40<>\"\",Score!G40,\"\")","v":""},{"$f":"IF(Score!H40<>\"\",Score!H40,\"\")","v":""},1,1,1,"",{"$f":"IF($K$4<>0,HLOOKUP($K$4,$O$4:$XFD33,ROW()-3,FALSE),\"\")","v":""},{"$f":"IF($K$4<>0,HLOOKUP(CONCATENATE($K$4,\"1\"),$O$4:$XFD33,ROW()-3,FALSE),\"\")","v":""},{"$f":"IF($K$4<>0,HLOOKUP(CONCATENATE($K$4,\"2\"),$O$4:$XFD33,ROW()-3,FALSE),\"\")","v":""},{"$nulls":3},{"$f":"IF(OR($E33=\"\",$F33=\"\",O33=\"\",P33=\"\"),\"\",IF(AND(O33=$E33,P33=$F33),Reglement!$S$3*$J33,IF(SIGN($E33-$F33)=SIGN(O33-P33),Reglement!$S$4*$J33,0))*IF(AND($E33+$F33>=6,O33+P33>=6),Reglement!$S$29,IF(AND($E33+$F33>=4,O33+P33>=4),Reglement!$S$28,1)))","v":""}]
[null,null,{"$f":"Score!F41","v":"Watford"},{"$f":"Score!I41","v":"West Ham"},{"$f":"IF(Score!G41<>\"\",Score!G41,\"\")","v":""},{"$f":"IF(Score!H41<>\"\",Score!H41,\"\")","v":""},1,1,1,"",{"$f":"IF($K$4<>0,HLOOKUP($K$4,$O$4:$XFD34,ROW()-3,FALSE),\"\")","v":""},{"$f":"IF($K$4<>0,HLOOKUP(CONCATENATE($K$4,\"1\"),$O$4:$XFD34,ROW()-3,FALSE),\"\")","v":""},{"$f":"IF($K$4<>0,HLOOKUP(CONCATENATE($K$4,\"2\"),$O$4:$XFD34,ROW()-3,FALSE),\"\")","v":""},{"$nulls":3},{"$f":"IF(OR($E34=\"\",$F34=\"\",O34=\"\",P34=\"\"),\"\",IF(AND(O34=$E34,P34=$F34),Reglement!$S$3*$J34,IF(SIGN($E34-$F34)=SIGN(O34-P34),Reglement!$S$4*$J34,0))*IF(AND($E34+$F34>=6,O34+P34>=6),Reglement!$S$29,IF(AND($E34+$F34>=4,O34+P34>=4),Reglement!$S$28,1)))","v":""}]
[null,null,{"$f":"Score!F42","v":"Wolverhampton"},{"$f":"Score!I42","v":"Burnley"},{"$f":"IF(Score!G42<>\"\",Score!G42,\"\")","v":""},{"$f":"IF(Score!H42<>\"\",Score!H42,\"\")","v":""},1,1,1,"",{"$f":"IF($K$4<>0,HLOOKUP($K$4,$O$4:$XFD35,ROW()-3,FALSE),\"\")","v":""},{"$f":"IF($K$4<>0,HLOOKUP(CONCATENATE($K$4,\"1\"),$O$4:$XFD35,ROW()-3,FALSE),\"\")","v":""},{"$f":"IF($K$4<>0,HLOOKUP(CONCATENATE($K$4,\"2\"),$O$4:$XFD35,ROW()-3,FALSE),\"\")","v":""},{"$nulls":3},{"$f":"IF(OR($E35=\"\",$F35=\"\",O35=\"\",P35=\"\"),\"\",IF(AND(O35=$E35,P35=$F35),Reglement!$S$3*$J35,IF(SIGN($E35-$F35)=SIGN(O35-P35),Reglement!$S$4*$J35,0))*IF(AND($E35+$F35>=6,O35+P35>=6),Reglement!$S$29,IF(AND($E35+$F35>=4,O35+P35>=4),Reglement!$S$28,1)))","v":""}]
["JOURNEE n°4",null,{"$f":"Score!F46","v":"Arsenal"},{"$f":"Score!I46","v":"Tottenham"},{"$f":"IF(Score!G46<>\"\",Score!G46,\"\")","v":""},{"$f":"IF(Score!H46<>\"\",Score!H46,\"\")","v":""},1,1,1,"",{"$f":"IF($K$4<>0,HLOOKUP($K$4,$O$4:$XFD36,ROW()-3,FALSE),\"\")","v":""},{"$f":"IF($K$4<>0,HLOOKUP(CONCATENATE($K$4,\"1\"),$O$4:$XFD36,ROW()-3,FALSE),\"\")","v":""},{"$f":"IF($K$4<>0,HLOOKUP(CONCATENATE($K$4,\"2\"),$O$4:$XFD36,ROW()-3,FALSE),\"\")","v":""},{"$nulls":3},{"$f":"IF(OR($E36=\"\",$F36=\"\",O36=\"\",P36=\"\"),\"\",IF(AND(O36=$E36,P36=$F36),Reglement!$S$3*$J36,IF(SIGN($E36-$F36)=SIGN(O36-P36),Reglement!$S$4*$J36,0))*IF(AND($E36+$F36>=6,O36+P36>=6),Reglement!$S$29,IF(AND($E36+$F36>=4,O36+P36>=4),Reglement!$S$28,1)))","v":""}]
[null,null,{"$f":"Score!F47","v":"Burnley"},{"$f":"Score!I47","v":"Liverpool"},{"$f":"IF(Score!G47<>\"\",Score!G47,\"\")","v":""},{"$f":"IF(Score!H47<>\"\",Score!H47,\"\")","v":""},1,1,1,"",{"$f":"IF($K$4<>0,HLOOKUP($K$4,$O$4:$XFD37,ROW()-3,FALSE),\"\")","v":""},{"$f":"IF($K$4<>0,HLOOKUP(CONCATENATE($K$4,\"1\"),$O$4:$XFD37,ROW()-3,FALSE),\"\")","v":""},{"$f":"IF($K$4<>0,HLOOKUP(CONCATENATE($K$4,\"2\"),$O$4:$XFD37,ROW()-3,FALSE),\"\")","v":""},{"$nulls":3},{"$f":"IF(OR($E37=\"\",$F37=\"\",O37=\"\",P37=\"\"),\"\",IF(AND(O37=$E37,P37=$F37),Reglement!$S$3*$J37,IF(SIGN($E37-$F37)=SIGN(O37-P37),Reglement!$S$4*$J37,0))*IF(AND($E37+$F37>=6,O37+P37>=6),Reglement!$S$29,IF(AND($E37+$F37>=4,O37+P37>=4),Reglement!$S$28,1)))","v":""}]
[null,null,{"$f":"Score!F48","v":"Chelsea"},{"$f":"Score!I48","v":"Sheffield United"},{"$f":"IF(Score!G48<>\"\",Score!G48,\"\")","v":""},{"$f":"IF(Score!H48<>\"\",Score!H48,\"\")","v":""},1,1,1,"",{"$f":"IF($K$4<>0,HLOOKUP($K$4,$O$4:$XFD38,ROW()-3,FALSE),\"\")","v":""},{"$f":"IF($K$4<>0,HLOOKUP(CONCATENATE($K$4,\"1\"),$O$4:$XFD38,ROW()-3,FALSE),\"\")","v":""},{"$f":"IF($K$4<>0,HLOOKUP(CONCATENATE($K$4,\"2\"),$O$4:$XFD38,ROW()-3,FALSE),\"\")","v":""},{"$nulls":3},{"$f":"IF(OR($E38=\"\",$F38=\"\",O38=\"\",P38=\"\"),\"\",IF(AND(O38=$E38,P38=$F38),Reglement!$S$3*$J38,IF(SIGN($E38-$F38)=SIGN(O38-P38),Reglement!$S$4*$J38,0))*IF(AND($E38+$F38>=6,O38+P38>=6),Reglement!$S$29,IF(AND($E38+$F38>=4,O38+P38>=4),Reglement!$S$28,1)))","v":""}]
[null,null,{"$f":"Score!F49","v":"Crystal Palace"},{"$f":"Score!I49","v":"Aston Villa"},{"$f":"IF(Score!G49<>\"\",Score!G49,\"\")","v":""},{"$f":"IF(Score!H49<>\"\",Score!H49,\"\")","v":""},1,1,1,"",{"$f":"IF($K$4<>0,HLOOKUP($K$4,$O$4:$XFD39,ROW()-3,FALSE),\"\")","v":""},{"$f":"IF($K$4<>0,HLOOKUP(CONCATENATE($K$4,\"1\"),$O$4:$XFD39,ROW()-3,FALSE),\"\")","v":""},{"$f":"IF($K$4<>0,HLOOKUP(CONCATENATE($K$4,\"2\"),$O$4:$XFD39,ROW()-3,FALSE),\"\")","v":""},{"$nulls":3},{"$f":"IF(OR($E39=\"\",$F39=\"\",O39=\"\",P39=\"\"),\"\",IF(AND(O39=$E39,P39=$F39),Reglement!$S$3*$J39,IF(SIGN($E39-$F39)=SIGN(O39-P39),Reglement!$S$4*$J39,0))*IF(AND($E39+$F39>=6,O39+P39>=6),Reglement!$S$29,IF(AND($E39+$F39>=4,O39+P39>=4),Reglement!$S$28,1)))","v":""}]
[null,null,{"$f":"Score!F50","v":"Everton"},{"$f":"Score!I50","v":"Wolverhampton"},{"$f":"IF(Score!G50<>\"\",Score!G50,\"\")","v":""},{"$f":"IF(Score!H50<>\"\",Score!H50,\"\")","v":""},1,1,1,"",{"$f":"IF($K$4<>0,HLOOKUP($K$4,$O$4:$XFD40,ROW()-3,FALSE),\"\")","v":""},{"$f":"IF($K$4<>0,HLOOKUP(CONCATENATE($K$4,\"1\"),$O$4:$XFD40,ROW()-3,FALSE),\"\")","v":""},{"$f":"IF($K$4<>0,HLOOKUP(CONCATENATE($K$4,\"2\"),$O$4:$XFD40,ROW()-3,FALSE),\"\")","v":""},{"$nulls":3},{"$f":"IF(OR($E40=\"\",$F40=\"\",O40=\"\",P40=\"\"),\"\",IF(AND(O40=$E40,P40=$F40),Reglement!$S$3*$J40,IF(SIGN($E40-$F40)=SIGN(O40-P40),Reglement!$S$4*$J40,0))*IF(AND($E40+$F40>=6,O40+P40>=6),Reglement!$S$29,IF(AND($E40+$F40>=4,O40+P40>=4),Reglement!$S$28,1)))","v":""}]
[null,null,{"$f":"Score!F51","v":"Leicester City"},{"$f":"Score!I51","v":"Bournemouth"},{"$f":"IF(Score!G51<>\"\",Score!G51,\"\")","v":""},{"$f":"IF(Score!H51<>\"\",Score!H51,\"\")","v":""},1,1,1,"",{"$f":"IF($K$4<>0,HLOOKUP($K$4,$O$4:$XFD41,ROW()-3,FALSE),\"\")","v":""},{"$f":"IF($K$4<>0,HLOOKUP(CONCATENATE($K$4,\"1\"),$O$4:$XFD41,ROW()-3,FALSE),\"\")","v":""},{"$f":"IF($K$4<>0,HLOOKUP(CONCATENATE($K$4,\"2\"),$O$4:$XFD41,ROW()-3,FALSE),\"\")","v":""},{"$nulls":3},{"$f":"IF(OR($E41=\"\",$F41=\"\",O41=\"\",P41=\"\"),\"\",IF(AND(O41=$E41,P41=$F41),Reglement!$S$3*$J41,IF(SIGN($E41-$F41)=SIGN(O41-P41),Reglement!$S$4*$J41,0))*IF(AND($E41+$F41>=6,O41+P41>=6),Reglement!$S$29,IF(AND($E41+$F41>=4,O41+P41>=4),Reglement!$S$28,1)))","v":""}]
[null,null,{"$f":"Score!F52","v":"Manchester City"},{"$f":"Score!I52","v":"Brighton"},{"$f":"IF(Score!G52<>\"\",Score!G52,\"\")","v":""},{"$f":"IF(Score!H52<>\"\",Score!H52,\"\")","v":""},1,1,1,"",{"$f":"IF($K$4<>0,HLOOKUP($K$4,$O$4:$XFD42,ROW()-3,FALSE),\"\")","v":""},{"$f":"IF($K$4<>0,HLOOKUP(CONCATENATE($K$4,\"1\"),$O$4:$XFD42,ROW()-3,FALSE),\"\")","v":""},{"$f":"IF($K$4<>0,HLOOKUP(CONCATENATE($K$4,\"2\"),$O$4:$XFD42,ROW()-3,FALSE),\"\")","v":""},{"$nulls":3},{"$f":"IF(OR($E42=\"\",$F42=\"\",O42=\"\",P42=\"\"),\"\",IF(AND(O42=$E42,P42=$F42),Reglement!$S$3*$J42,IF(SIGN($E42-$F42)=SIGN(O42-P42),Reglement!$S$4*$J42,0))*IF(AND($E42+$F42>=6,O42+P42>=6),Reglement!$S$29,IF(AND($E42+$F42>=4,O42+P42>=4),Reglement!$S$28,1)))","v":""}]
[null,null,{"$f":"Score!F53","v":"Newcastle"},{"$f":"Score!I53","v":"Watford"},{"$f":"IF(Score!G53<>\"\",Score!G53,\"\")","v":""},{"$f":"IF(Score!H53<>\"\",Score!H53,\"\")","v":""},1,1,1,"",{"$f":"IF($K$4<>0,HLOOKUP($K$4,$O$4:$XFD43,ROW()-3,FALSE),\"\")","v":""},{"$f":"IF($K$4<>0,HLOOKUP(CONCATENATE($K$4,\"1\"),$O$4:$XFD43,ROW()-3,FALSE),\"\")","v":""},{"$f":"IF($K$4<>0,HLOOKUP(CONCATENATE($K$4,\"2\"),$O$4:$XFD43,ROW()-3,FALSE),\"\")","v":""},{"$nulls":3},{"$f":"IF(OR($E43=\"\",$F43=\"\",O43=\"\",P43=\"\"),\"\",IF(AND(O43=$E43,P43=$F43),Reglement!$S$3*$J43,IF(SIGN($E43-$F43)=SIGN(O43-P43),Reglement!$S$4*$J43,0))*IF(AND($E43+$F43>=6,O43+P43>=6),Reglement!$S$29,IF(AND($E43+$F43>=4,O43+P43>=4),Reglement!$S$28,1)))","v":""}]
[null,null,{"$f":"Score!F54","v":"Southampton"},{"$f":"Score!I54","v":"Manchester United"},{"$f":"IF(Score!G54<>\"\",Score!G54,\"\")","v":""},{"$f":"IF(Score!H54<>\"\",Score!H54,\"\")","v":""},1,1,1,"",{"$f":"IF($K$4<>0,HLOOKUP($K$4,$O$4:$XFD44,ROW()-3,FALSE),\"\")","v":""},{"$f":"IF($K$4<>0,HLOOKUP(CONCATENATE($K$4,\"1\"),$O$4:$XFD44,ROW()-3,FALSE),\"\")","v":""},{"$f":"IF($K$4<>0,HLOOKUP(CONCATENATE($K$4,\"2\"),$O$4:$XFD44,ROW()-3,FALSE),\"\")","v":""},{"$nulls":3},{"$f":"IF(OR($E44=\"\",$F44=\"\",O44=\"\",P44=\"\"),\"\",IF(AND(O44=$E44,P44=$F44),Reglement!$S$3*$J44,IF(SIGN($E44-$F44)=SIGN(O44-P44),Reglement!$S$4*$J44,0))*IF(AND($E44+$F44>=6,O44+P44>=6),Reglement!$S$29,IF(AND($E44+$F44>=4,O44+P44>=4),Reglement!$S$28,1)))","v":""}]
[null,null,{"$f":"Score!F55","v":"West Ham"},{"$f":"Score!I55","v":"Norwich"},{"$f":"IF(Score!G55<>\"\",Score!G55,\"\")","v":""},{"$f":"IF(Score!H55<>\"\",Score!H55,\"\")","v":""},1,1,1,"",{"$f":"IF($K$4<>0,HLOOKUP($K$4,$O$4:$XFD45,ROW()-3,FALSE),\"\")","v":""},{"$f":"IF($K$4<>0,HLOOKUP(CONCATENATE($K$4,\"1\"),$O$4:$XFD45,ROW()-3,FALSE),\"\")","v":""},{"$f":"IF($K$4<>0,HLOOKUP(CONCATENATE($K$4,\"2\"),$O$4:$XFD45,ROW()-3,FALSE),\"\")","v":""},{"$nulls":3},{"$f":"IF(OR($E45=\"\",$F45=\"\",O45=\"\",P45=\"\"),\"\",IF(AND(O45=$E45,P45=$F45),Reglement!$S$3*$J45,IF(SIGN($E45-$F45)=SIGN(O45-P45),Reglement!$S$4*$J45,0))*IF(AND($E45+$F45>=6,O45+P45>=6),Reglement!$S$29,IF(AND($E45+$F45>=4,O45+P45>=4),Reglement!$S$28,1)))","v":""}]
["JOURNEE n°5",null,{"$f":"Score!F59","v":"Bournemouth"},{"$f":"Score!I59","v":"Everton"},{"$f":"IF(Score!G59<>\"\",Score!G59,\"\")","v":""},{"$f":"IF(Score!H59<>\"\",Score!H59,\"\")","v":""},1,1,1,"",{"$f":"IF($K$4<>0,HLOOKUP($K$4,$O$4:$XFD46,ROW()-3,FALSE),\"\")","v":""},{"$f":"IF($K$4<>0,HLOOKUP(CONCATENATE($K$4,\"1\"),$O$4:$XFD46,ROW()-3,FALSE),\"\")","v":""},{"$f":"IF($K$4<>0,HLOOKUP(CONCATENATE($K$4,\"2\"),$O$4:$XFD46,ROW()-3,FALSE),\"\")","v":""},{"$nulls":3},{"$f":"IF(OR($E46=\"\",$F46=\"\",O46=\"\",P46=\"\"),\"\",IF(AND(O46=$E46,P46=$F46),Reglement!$S$3*$J46,IF(SIGN($E46-$F46)=SIGN(O46-P46),Reglement!$S$4*$J46,0))*IF(AND($E46+$F46>=6,O46+P46>=6),Reglement!$S$29,IF(AND($E46+$F46>=4,O46+P46>=4),Reglement!$S$28,1)))","v":""}]
[null,null,{"$f":"Score!F60","v":"Aston Villa"},{"$f":"Score!I60","v":"West Ham"},{"$f":"IF(Score!G60<>\"\",Score!G60,\"\")","v":""},{"$f":"IF(Score!H60<>\"\",Score!H60,\"\")","v":""},1,1,1,"",{"$f":"IF($K$4<>0,HLOOKUP($K$4,$O$4:$XFD47,ROW()-3,FALSE),\"\")","v":""},{"$f":"IF($K$4<>0,HLOOKUP(CONCATENATE($K$4,\"1\"),$O$4:$XFD47,ROW()-3,FALSE),\"\")","v":""},{"$f":"IF($K$4<>0,HLOOKUP(CONCATENATE($K$4,\"2\"),$O$4:$XFD47,ROW()-3,FALSE),\"\")","v":""},{"$nulls":3},{"$f":"IF(OR($E47=\"\",$F47=\"\",O47=\"\",P47=\"\"),\"\",IF(AND(O47=$E47,P47=$F47),Reglement!$S$3*$J47,IF(SIGN($E47-$F47)=SIGN(O47-P47),Reglement!$S$4*$J47,0))*IF(AND($E47+$F47>=6,O47+P47>=6),Reglement!$S$29,IF(AND($E47+$F47>=4,O47+P47>=4),Reglement!$S$28,1)))","v":""}]
[null,null,{"$f":"Score!F61","v":"Brighton"},{"$f":"Score!I61","v":"Burnley"},{"$f":"IF(Score!G61<>\"\",Score!G61,\"\")","v":""},{"$f":"IF(Score!H61<>\"\",Score!H61,\"\")","v":""},1,1,1,"",{"$f":"IF($K$4<>0,HLOOKUP($K$4,$O$4:$XFD48,ROW()-3,FALSE),\"\")","v":""},{"$f":"IF($K$4<>0,HLOOKUP(CONCATENATE($K$4,\"1\"),$O$4:$XFD48,ROW()-3,FALSE),\"\")","v":""},{"$f":"IF($K$4<>0,HLOOKUP(CONCATENATE($K$4,\"2\"),$O$4:$XFD48,ROW()-3,FALSE),\"\")","v":""},{"$nulls":3},{"$f":"IF(OR($E48=\"\",$F48=\"\",O48=\"\",P48=\"\"),\"\",IF(AND(O48=$E48,P48=$F48),Reglement!$S$3*$J48,IF(SIGN($E48-$F48)=SIGN(O48-P48),Reglement!$S$4*$J48,0))*IF(AND($E48+$F48>=6,O48+P48>=6),Reglement!$S$29,IF(AND($E48+$F48>=4,O48+P48>=4),Reglement!$S$28,1)))","v":""}]
[null,null,{"$f":"Score!F62","v":"Liverpool"},{"$f":"Score!I62","v":"Newcastle"},{"$f":"IF(Score!G62<>\"\",Score!G62,\"\")","v":""},{"$f":"IF(Score!H62<>\"\",Score!H62,\"\")","v":""},1,1,1,"",{"$f":"IF($K$4<>0,HLOOKUP($K$4,$O$4:$XFD49,ROW()-3,FALSE),\"\")","v":""},{"$f":"IF($K$4<>0,HLOOKUP(CONCATENATE($K$4,\"1\"),$O$4:$XFD49,ROW()-3,FALSE),\"\")","v":""},{"$f":"IF($K$4<>0,HLOOKUP(CONCATENATE($K$4,\"2\"),$O$4:$XFD49,ROW()-3,FALSE),\"\")","v":""},{"$nulls":3},{"$f":"IF(OR($E49=\"\",$F49=\"\",O49=\"\",P49=\"\"),\"\",IF(AND(O49=$E49,P49=$F49),Reglement!$S$3*$J49,IF(SIGN($E49-$F49)=SIGN(O49-P49),Reglement!$S$4*$J49,0))*IF(AND($E49+$F49>=6,O49+P49>=6),Reglement!$S$29,IF(AND($E49+$F49>=4,O49+P49>=4),Reglement!$S$28,1)))","v":""}]
[null,null,{"$f":"Score!F63","v":"Manchester United"},{"$f":"Score!I63","v":"Leicester City"},{"$f":"IF(Score!G63<>\"\",Score!G63,\"\")","v":""},{"$f":"IF(Score!H63<>\"\",Score!H63,\"\")","v":""},1,1,1,"",{"$f":"IF($K$4<>0,HLOOKUP($K$4,$O$4:$XFD50,ROW()-3,FALSE),\"\")","v":""},{"$f":"IF($K$4<>0,HLOOKUP(CONCATENATE($K$4,\"1\"),$O$4:$XFD50,ROW()-3,FALSE),\"\")","v":""},{"$f":"IF($K$4<>0,HLOOKUP(CONCATENATE($K$4,\"2\"),$O$4:$XFD50,ROW()-3,FALSE),\"\")","v":""},{"$nulls":3},{"$f":"IF(OR($E50=\"\",$F50=\"\",O50=\"\",P50=\"\"),\"\",IF(AND(O50=$E50,P50=$F50),Reglement!$S$3*$J50,IF(SIGN($E50-$F50)=SIGN(O50-P50),Reglement!$S$4*$J50,0))*IF(AND($E50+$F50>=6,O50+P50>=6),Reglement!$S$29,IF(AND($E50+$F50>=4,O50+P50>=4),Reglement!$S$28,1)))","v":""}]
[null,null,{"$f":"Score!F64","v":"Norwich"},{"$f":"Score!I64","v":"Manchester City"},{"$f":"IF(Score!G64<>\"\",Score!G64,\"\")","v":""},{"$f":"IF(Score!H64<>\"\",Score!H64,\"\")","v":""},1,1,1,"",{"$f":"IF($K$4<>0,HLOOKUP($K$4,$O$4:$XFD51,ROW()-3,FALSE),\"\")","v":""},{"$f":"IF($K$4<>0,HLOOKUP(CONCATENATE($K$4,\"1\"),$O$4:$XFD51,ROW()-3,FALSE),\"\")","v":""},{"$f":"IF($K$4<>0,HLOOKUP(CONCATENATE($K$4,\"2\"),$O$4:$XFD51,ROW()-3,FALSE),\"\")","v":""},{"$nulls":3},{"$f":"IF(OR($E51=\"\",$F51=\"\",O51=\"\",P51=\"\"),\"\",IF(AND(O51=$E51,P51=$F51),Reglement!$S$3*$J51,IF(SIGN($E51-$F51)=SIGN(O51-P51),Reglement!$S$4*$J51,0))*IF(AND($E51+$F51>=6,O51+P51>=6),Reglement!$S$29,IF(AND($E51+$F51>=4,O51+P51>=4),Reglement!$S$28,1)))","v":""}]
[null,null,{"$f":"Score!F65","v":"Sheffield United"},{"$f":"Score!I65","v":"Southampton"},{"$f":"IF(Score!G65<>\"\",Score!G65,\"\")","v":""},{"$f":"IF(Score!H65<>\"\",Score!H65,\"\")","v":""},1,1,1,"",{"$f":"IF($K$4<>0,HLOOKUP($K$4,$O$4:$XFD52,ROW()-3,FALSE),\"\")","v":""},{"$f":"IF($K$4<>0,HLOOKUP(CONCATENATE($K$4,\"1\"),$O$4:$XFD52,ROW()-3,FALSE),\"\")","v":""},{"$f":"IF($K$4<>0,HLOOKUP(CONCATENATE($K$4,\"2\"),$O$4:$XFD52,ROW()-3,FALSE),\"\")","v":""},{"$nulls":3},{"$f":"IF(OR($E52=\"\",$F52=\"\",O52=\"\",P52=\"\"),\"\",IF(AND(O52=$E52,P52=$F52),Reglement!$S$3*$J52,IF(SIGN($E52-$F52)=SIGN(O52-P52),Reglement!$S$4*$J52,0))*IF(AND($E52+$F52>=6,O52+P52>=6),Reglement!$S$29,IF(AND($E52+$F52>=4,O52+P52>=4),Reglement!$S$28,1)))","v":""}]
[null,null,{"$f":"Score!F66","v":"Tottenham"},{"$f":"Score!I66","v":"Crystal Palace"},{"$f":"IF(Score!G66<>\"\",Score!G66,\"\")","v":""},{"$f":"IF(Score!H66<>\"\",Score!H66,\"\")","v":""},1,1,1,"",{"$f":"IF($K$4<>0,HLOOKUP($K$4,$O$4:$XFD53,ROW()-3,FALSE),\"\")","v":""},{"$f":"IF($K$4<>0,HLOOKUP(CONCATENATE($K$4,\"1\"),$O$4:$XFD53,ROW()-3,FALSE),\"\")","v":""},{"$f":"IF($K$4<>0,HLOOKUP(CONCATENATE($K$4,\"2\"),$O$4:$XFD53,ROW()-3,FALSE),\"\")","v":""},{"$nulls":3},{"$f":"IF(OR($E53=\"\",$F53=\"\",O53=\"\",P53=\"\"),\"\",IF(AND(O53=$E53,P53=$F53),Reglement!$S$3*$J53,IF(SIGN($E53-$F53)=SIGN(O53-P53),Reglement!$S$4*$J53,0))*IF(AND($E53+$F53>=6,O53+P53>=6),Reglement!$S$29,IF(AND($E53+$F53>=4,O53+P53>=4),Reglement!$S$28,1)))","v":""}]
[null,null,{"$f":"Score!F67","v":"Watford"},{"$f":"Score!I67","v":"Arsenal"},{"$f":"IF(Score!G67<>\"\",Score!G67,\"\")","v":""},{"$f":"IF(Score!H67<>\"\",Score!H67,\"\")","v":""},1,1,1,"",{"$f":"IF($K$4<>0,HLOOKUP($K$4,$O$4:$XFD54,ROW()-3,FALSE),\"\")","v":""},{"$f":"IF($K$4<>0,HLOOKUP(CONCATENATE($K$4,\"1\"),$O$4:$XFD54,ROW()-3,FALSE),\"\")","v":""},{"$f":"IF($K$4<>0,HLOOKUP(CONCATENATE($K$4,\"2\"),$O$4:$XFD54,ROW()-3,FALSE),\"\")","v":""},{"$nulls":3},{"$f":"IF(OR($E54=\"\",$F54=\"\",O54=\"\",P54=\"\"),\"\",IF(AND(O54=$E54,P54=$F54),Reglement!$S$3*$J54,IF(SIGN($E54-$F54)=SIGN(O54-P54),Reglement!$S$4*$J54,0))*IF(AND($E54+$F54>=6,O54+P54>=6),Reglement!$S$29,IF(AND($E54+$F54>=4,O54+P54>=4),Reglement!$S$28,1)))","v":""}]
[null,null,{"$f":"Score!F68","v":"Wolverhampton"},{"$f":"Score!I68","v":"Chelsea"},{"$f":"IF(Score!G68<>\"\",Score!G68,\"\")","v":""},{"$f":"IF(Score!H68<>\"\",Score!H68,\"\")","v":""},1,1,1,"",{"$f":"IF($K$4<>0,HLOOKUP($K$4,$O$4:$XFD55,ROW()-3,FALSE),\"\")","v":""},{"$f":"IF($K$4<>0,HLOOKUP(CONCATENATE($K$4,\"1\"),$O$4:$XFD55,ROW()-3,FALSE),\"\")","v":""},{"$f":"IF($K$4<>0,HLOOKUP(CONCATENATE($K$4,\"2\"),$O$4:$XFD55,ROW()-3,FALSE),\"\")","v":""},{"$nulls":3},{"$f":"IF(OR($E55=\"\",$F55=\"\",O55=\"\",P55=\"\"),\"\",IF(AND(O55=$E55,P55=$F55),Reglement!$S$3*$J55,IF(SIGN($E55-$F55)=SIGN(O55-P55),Reglement!$S$4*$J55,0))*IF(AND($E55+$F55>=6,O55+P55>=6),Reglement!$S$29,IF(AND($E55+$F55>=4,O55+P55>=4),Reglement!$S$28,1)))","v":""}]
["JOURNEE n°6",null,{"$f":"Score!F72","v":"Arsenal"},{"$f":"Score!I72","v":"Aston Villa"},{"$f":"IF(Score!G72<>\"\",Score!G72,\"\")","v":""},{"$f":"IF(Score!H72<>\"\",Score!H72,\"\")","v":""},1,1,1,"",{"$f":"IF($K$4<>0,HLOOKUP($K$4,$O$4:$XFD56,ROW()-3,FALSE),\"\")","v":""},{"$f":"IF($K$4<>0,HLOOKUP(CONCATENATE($K$4,\"1\"),$O$4:$XFD56,ROW()-3,FALSE),\"\")","v":""},{"$f":"IF($K$4<>0,HLOOKUP(CONCATENATE($K$4,\"2\"),$O$4:$XFD56,ROW()-3,FALSE),\"\")","v":""},{"$nulls":3},{"$f":"IF(OR($E56=\"\",$F56=\"\",O56=\"\",P56=\"\"),\"\",IF(AND(O56=$E56,P56=$F56),Reglement!$S$3*$J56,IF(SIGN($E56-$F56)=SIGN(O56-P56),Reglement!$S$4*$J56,0))*IF(AND($E56+$F56>=6,O56+P56>=6),Reglement!$S$29,IF(AND($E56+$F56>=4,O56+P56>=4),Reglement!$S$28,1)))","v":""}]
[null,null,{"$f":"Score!F73","v":"Burnley"},{"$f":"Score!I73","v":"Norwich"},{"$f":"IF(Score!G73<>\"\",Score!G73,\"\")","v":""},{"$f":"IF(Score!H73<>\"\",Score!H73,\"\")","v":""},1,1,1,"",{"$f":"IF($K$4<>0,HLOOKUP($K$4,$O$4:$XFD57,ROW()-3,FALSE),\"\")","v":""},{"$f":"IF($K$4<>0,HLOOKUP(CONCATENATE($K$4,\"1\"),$O$4:$XFD57,ROW()-3,FALSE),\"\")","v":""},{"$f":"IF($K$4<>0,HLOOKUP(CONCATENATE($K$4,\"2\"),$O$4:$XFD57,ROW()-3,FALSE),\"\")","v":""},{"$nulls":3},{"$f":"IF(OR($E57=\"\",$F57=\"\",O57=\"\",P57=\"\"),\"\",IF(AND(O57=$E57,P57=$F57),Reglement!$S$3*$J57,IF(SIGN($E57-$F57)=SIGN(O57-P57),Reglement!$S$4*$J57,0))*IF(AND($E57+$F57>=6,O57+P57>=6),Reglement!$S$29,IF(AND($E57+$F57>=4,O57+P57>=4),Reglement!$S$28,1)))","v":""}]
[null,null,{"$f":"Score!F74","v":"Chelsea"},{"$f":"Score!I74","v":"Liverpool"},{"$f":"IF(Score!G74<>\"\",Score!G74,\"\")","v":""},{"$f":"IF(Score!H74<>\"\",Score!H74,\"\")","v":""},1,1,1,"",{"$f":"IF($K$4<>0,HLOOKUP($K$4,$O$4:$XFD58,ROW()-3,FALSE),\"\")","v":""},{"$f":"IF($K$4<>0,HLOOKUP(CONCATENATE($K$4,\"1\"),$O$4:$XFD58,ROW()-3,FALSE),\"\")","v":""},{"$f":"IF($K$4<>0,HLOOKUP(CONCATENATE($K$4,\"2\"),$O$4:$XFD58,ROW()-3,FALSE),\"\")","v":""},{"$nulls":3},{"$f":"IF(OR($E58=\"\",$F58=\"\",O58=\"\",P58=\"\"),\"\",IF(AND(O58=$E58,P58=$F58),Reglement!$S$3*$J58,IF(SIGN($E58-$F58)=SIGN(O58-P58),Reglement!$S$4*$J58,0))*IF(AND($E58+$F58>=6,O58+P58>=6),Reglement!$S$29,IF(AND($E58+$F58>=4,O58+P58>=4),Reglement!$S$28,1)))","v":""}]
[null,null,{"$f":"Score!F75","v":"Crystal Palace"},{"$f":"Score!I75","v":"Wolverhampton"},{"$f":"IF(Score!G75<>\"\",Score!G75,\"\")","v":""},{"$f":"IF(Score!H75<>\"\",Score!H75,\"\")","v":""},1,1,1,"",{"$f":"IF($K$4<>0,HLOOKUP($K$4,$O$4:$XFD59,ROW()-3,FALSE),\"\")","v":""},{"$f":"IF($K$4<>0,HLOOKUP(CONCATENATE($K$4,\"1\"),$O$4:$XFD59,ROW()-3,FALSE),\"\")","v":""},{"$f":"IF($K$4<>0,HLOOKUP(CONCATENATE($K$4,\"2\"),$O$4:$XFD59,ROW()-3,FALSE),\"\")","v":""},{"$nulls":3},{"$f":"IF(OR($E59=\"\",$F59=\"\",O59=\"\",P59=\"\"),\"\",IF(AND(O59=$E59,P59=$F59),Reglement!$S$3*$J59,IF(SIGN($E59-$F59)=SIGN(O59-P59),Reglement!$S$4*$J59,0))*IF(AND($E59+$F59>=6,O59+P59>=6),Reglement!$S$29,IF(AND($E59+$F59>=4,O59+P59>=4),Reglement!$S$28,1)))","v":""}]
[null,null,{"$f":"Score!F76","v":"Everton"},{"$f":"Score!I76","v":"Sheffield United"},{"$f":"IF(Score!G76<>\"\",Score!G76,\"\")","v":""},{"$f":"IF(Score!H76<>\"\",Score!H76,\"\")","v":""},1,1,1,"",{"$f":"IF($K$4<>0,HLOOKUP($K$4,$O$4:$XFD60,ROW()-3,FALSE),\"\")","v":""},{"$f":"IF($K$4<>0,HLOOKUP(CONCATENATE($K$4,\"1\"),$O$4:$XFD60,ROW()-3,FALSE),\"\")","v":""},{"$f":"IF($K$4<>0,HLOOKUP(CONCATENATE($K$4,\"2\"),$O$4:$XFD60,ROW()-3,FALSE),\"\")","v":""},{"$nulls":3},{"$f":"IF(OR($E60=\"\",$F60=\"\",O60=\"\",P60=\"\"),\"\",IF(AND(O60=$E60,P60=$F60),Reglement!$S$3*$J60,IF(SIGN($E60-$F60)=SIGN(O60-P60),Reglement!$S$4*$J60,0))*IF(AND($E60+$F60>=6,O60+P60>=6),Reglement!$S$29,IF(AND($E60+$F60>=4,O60+P60>=4),Reglement!$S$28,1)))","v":""}]
[null,null,{"$f":"Score!F77","v":"Leicester City"},{"$f":"Score!I77","v":"Tottenham"},{"$f":"IF(Score!G77<>\"\",Score!G77,\"\")","v":""},{"$f":"IF(Score!H77<>\"\",Score!H77,\"\")","v":""},1,1,1,"",{"$f":"IF($K$4<>0,HLOOKUP($K$4,$O$4:$XFD61,ROW()-3,FALSE),\"\")","v":""},{"$f":"IF($K$4<>0,HLOOKUP(CONCATENATE($K$4,\"1\"),$O$4:$XFD61,ROW()-3,FALSE),\"\")","v":""},{"$f":"IF($K$4<>0,HLOOKUP(CONCATENATE($K$4,\"2\"),$O$4:$XFD61,ROW()-3,FALSE),\"\")","v":""},{"$nulls":3},{"$f":"IF(OR($E61=\"\",$F61=\"\",O61=\"\",P61=\"\"),\"\",IF(AND(O61=$E61,P61=$F61),Reglement!$S$3*$J61,IF(SIGN($E61-$F61)=SIGN(O61-P61),Reglement!$S$4*$J61,0))*IF(AND($E61+$F61>=6,O61+P61>=6),Reglement!$S$29,IF(AND($E61+$F61>=4,O61+P61>=4),Reglement!$S$28,1)))","v":""}]
[null,null,{"$f":"Score!F78","v":"Manchester City"},{"$f":"Score!I78","v":"Watford"},{"$f":"IF(Score!G78<>\"\",Score!G78,\"\")","v":""},{"$f":"IF(Score!H78<>\"\",Score!H78,\"\")","v":""},1,1,1,"",{"$f":"IF($K$4<>0,HLOOKUP($K$4,$O$4:$XFD62,ROW()-3,FALSE),\"\")","v":""},{"$f":"IF($K$4<>0,HLOOKUP(CONCATENATE($K$4,\"1\"),$O$4:$XFD62,ROW()-3,FALSE),\"\")","v":""},{"$f":"IF($K$4<>0,HLOOKUP(CONCATENATE($K$4,\"2\"),$O$4:$XFD62,ROW()-3,FALSE),\"\")","v":""},{"$nulls":3},{"$f":"IF(OR($E62=\"\",$F62=\"\",O62=\"\",P62=\"\"),\"\",IF(AND(O62=$E62,P62=$F62),Reglement!$S$3*$J62,IF(SIGN($E62-$F62)=SIGN(O62-P62),Reglement!$S$4*$J62,0))*IF(AND($E62+$F62>=6,O62+P62>=6),Reglement!$S$29,IF(AND($E62+$F62>=4,O62+P62>=4),Reglement!$S$28,1)))","v":""}]
[null,null,{"$f":"Score!F79","v":"Newcastle"},{"$f":"Score!I79","v":"Brighton"},{"$f":"IF(Score!G79<>\"\",Score!G79,\"\")","v":""},{"$f":"IF(Score!H79<>\"\",Score!H79,\"\")","v":""},1,1,1,"",{"$f":"IF($K$4<>0,HLOOKUP($K$4,$O$4:$XFD63,ROW()-3,FALSE),\"\")","v":""},{"$f":"IF($K$4<>0,HLOOKUP(CONCATENATE($K$4,\"1\"),$O$4:$XFD63,ROW()-3,FALSE),\"\")","v":""},{"$f":"IF($K$4<>0,HLOOKUP(CONCATENATE($K$4,\"2\"),$O$4:$XFD63,ROW()-3,FALSE),\"\")","v":""},{"$nulls":3},{"$f":"IF(OR($E63=\"\",$F63=\"\",O63=\"\",P63=\"\"),\"\",IF(AND(O63=$E63,P63=$F63),Reglement!$S$3*$J63,IF(SIGN($E63-$F63)=SIGN(O63-P63),Reglement!$S$4*$J63,0))*IF(AND($E63+$F63>=6,O63+P63>=6),Reglement!$S$29,IF(AND($E63+$F63>=4,O63+P63>=4),Reglement!$S$28,1)))","v":""}]
[null,null,{"$f":"Score!F80","v":"Southampton"},{"$f":"Score!I80","v":"Bournemouth"},{"$f":"IF(Score!G80<>\"\",Score!G80,\"\")","v":""},{"$f":"IF(Score!H80<>\"\",Score!H80,\"\")","v":""},1,1,1,"",{"$f":"IF($K$4<>0,HLOOKUP($K$4,$O$4:$XFD64,ROW()-3,FALSE),\"\")","v":""},{"$f":"IF($K$4<>0,HLOOKUP(CONCATENATE($K$4,\"1\"),$O$4:$XFD64,ROW()-3,FALSE),\"\")","v":""},{"$f":"IF($K$4<>0,HLOOKUP(CONCATENATE($K$4,\"2\"),$O$4:$XFD64,ROW()-3,FALSE),\"\")","v":""},{"$nulls":3},{"$f":"IF(OR($E64=\"\",$F64=\"\",O64=\"\",P64=\"\"),\"\",IF(AND(O64=$E64,P64=$F64),Reglement!$S$3*$J64,IF(SIGN($E64-$F64)=SIGN(O64-P64),Reglement!$S$4*$J64,0))*IF(AND($E64+$F64>=6,O64+P64>=6),Reglement!$S$29,IF(AND($E64+$F64>=4,O64+P64>=4),Reglement!$S$28,1)))","v":""}]
[null,null,{"$f":"Score!F81","v":"West Ham"},{"$f":"Score!I81","v":"Manchester United"},{"$f":"IF(Score!G81<>\"\",Score!G81,\"\")","v":""},{"$f":"IF(Score!H81<>\"\",Score!H81,\"\")","v":""},1,1,1,"",{"$f":"IF($K$4<>0,HLOOKUP($K$4,$O$4:$XFD65,ROW()-3,FALSE),\"\")","v":""},{"$f":"IF($K$4<>0,HLOOKUP(CONCATENATE($K$4,\"1\"),$O$4:$XFD65,ROW()-3,FALSE),\"\")","v":""},{"$f":"IF($K$4<>0,HLOOKUP(CONCATENATE($K$4,\"2\"),$O$4:$XFD65,ROW()-3,FALSE),\"\")","v":""},{"$nulls":3},{"$f":"IF(OR($E65=\"\",$F65=\"\",O65=\"\",P65=\"\"),\"\",IF(AND(O65=$E65,P65=$F65),Reglement!$S$3*$J65,IF(SIGN($E65-$F65)=SIGN(O65-P65),Reglement!$S$4*$J65,0))*IF(AND($E65+$F65>=6,O65+P65>=6),Reglement!$S$29,IF(AND($E65+$F65>=4,O65+P65>=4),Reglement!$S$28,1)))","v":""}]
["JOURNEE n°7",null,{"$f":"Score!F85","v":"Bournemouth"},{"$f":"Score!I85","v":"West Ham"},{"$f":"IF(Score!G85<>\"\",Score!G85,\"\")","v":""},{"$f":"IF(Score!H85<>\"\",Score!H85,\"\")","v":""},1,1,1,"",{"$f":"IF($K$4<>0,HLOOKUP($K$4,$O$4:$XFD66,ROW()-3,FALSE),\"\")","v":""},{"$f":"IF($K$4<>0,HLOOKUP(CONCATENATE($K$4,\"1\"),$O$4:$XFD66,ROW()-3,FALSE),\"\")","v":""},{"$f":"IF($K$4<>0,HLOOKUP(CONCATENATE($K$4,\"2\"),$O$4:$XFD66,ROW()-3,FALSE),\"\")","v":""},{"$nulls":3},{"$f":"IF(OR($E66=\"\",$F66=\"\",O66=\"\",P66=\"\"),\"\",IF(AND(O66=$E66,P66=$F66),Reglement!$S$3*$J66,IF(SIGN($E66-$F66)=SIGN(O66-P66),Reglement!$S$4*$J66,0))*IF(AND($E66+$F66>=6,O66+P66>=6),Reglement!$S$29,IF(AND($E66+$F66>=4,O66+P66>=4),Reglement!$S$28,1)))","v":""}]
[null,null,{"$f":"Score!F86","v":"Aston Villa"},{"$f":"Score!I86","v":"Burnley"},{"$f":"IF(Score!G86<>\"\",Score!G86,\"\")","v":""},{"$f":"IF(Score!H86<>\"\",Score!H86,\"\")","v":""},1,1,1,{"$f":"IF(OR(E67=\"\",F67=\"\"),\"\",IF(E67>F67,G67,IF(E67=F67,H67,I67)))","v":""},{"$f":"IF($K$4<>0,HLOOKUP($K$4,$O$4:$XFD67,ROW()-3,FALSE),\"\")","v":""},{"$f":"IF($K$4<>0,HLOOKUP(CONCATENATE($K$4,\"1\"),$O$4:$XFD67,ROW()-3,FALSE),\"\")","v":""},{"$f":"IF($K$4<>0,HLOOKUP(CONCATENATE($K$4,\"2\"),$O$4:$XFD67,ROW()-3,FALSE),\"\")","v":""},{"$nulls":3},{"$f":"IF(OR($E67=\"\",$F67=\"\",O67=\"\",P67=\"\"),\"\",IF(AND(O67=$E67,P67=$F67),Reglement!$S$3*$J67,IF(SIGN($E67-$F67)=SIGN(O67-P67),Reglement!$S$4*$J67,0))*IF(AND($E67+$F67>=6,O67+P67>=6),Reglement!$S$29,IF(AND($E67+$F67>=4,O67+P67>=4),Reglement!$S$28,1)))","v":""}]
[null,null,{"$f":"Score!F87","v":"Chelsea"},{"$f":"Score!I87","v":"Brighton"},{"$f":"IF(Score!G87<>\"\",Score!G87,\"\")","v":""},{"$f":"IF(Score!H87<>\"\",Score!H87,\"\")","v":""},1,1,1,"",{"$f":"IF($K$4<>0,HLOOKUP($K$4,$O$4:$XFD68,ROW()-3,FALSE),\"\")","v":""},{"$f":"IF($K$4<>0,HLOOKUP(CONCATENATE($K$4,\"1\"),$O$4:$XFD68,ROW()-3,FALSE),\"\")","v":""},{"$f":"IF($K$4<>0,HLOOKUP(CONCATENATE($K$4,\"2\"),$O$4:$XFD68,ROW()-3,FALSE),\"\")","v":""},{"$nulls":3},{"$f":"IF(OR($E68=\"\",$F68=\"\",O68=\"\",P68=\"\"),\"\",IF(AND(O68=$E68,P68=$F68),Reglement!$S$3*$J68,IF(SIGN($E68-$F68)=SIGN(O68-P68),Reglement!$S$4*$J68,0))*IF(AND($E68+$F68>=6,O68+P68>=6),Reglement!$S$29,IF(AND($E68+$F68>=4,O68+P68>=4),Reglement!$S$28,1)))","v":""}]
[null,null,{"$f":"Score!F88","v":"Crystal Palace"},{"$f":"Score!I88","v":"Norwich"},{"$f":"IF(Score!G88<>\"\",Score!G88,\"\")","v":""},{"$f":"IF(Score!H88<>\"\",Score!H88,\"\")","v":""},1,1,1,"",{"$f":"IF($K$4<>0,HLOOKUP($K$4,$O$4:$XFD69,ROW()-3,FALSE),\"\")","v":""},{"$f":"IF($K$4<>0,HLOOKUP(CONCATENATE($K$4,\"1\"),$O$4:$XFD69,ROW()-3,FALSE),\"\")","v":""},{"$f":"IF($K$4<>0,HLOOKUP(CONCATENATE($K$4,\"2\"),$O$4:$XFD69,ROW()-3,FALSE),\"\")","v":""},{"$nulls":3},{"$f":"IF(OR($E69=\"\",$F69=\"\",O69=\"\",P69=\"\"),\"\",IF(AND(O69=$E69,P69=$F69),Reglement!$S$3*$J69,IF(SIGN($E69-$F69)=SIGN(O69-P69),Reglement!$S$4*$J69,0))*IF(AND($E69+$F69>=6,O69+P69>=6),Reglement!$S$29,IF(AND($E69+$F69>=4,O69+P69>=4),Reglement!$S$28,1)))","v":""}]
[null,null,{"$f":"Score!F89","v":"Everton"},{"$f":"Score!I89","v":"Manchester City"},{"$f":"IF(Score!G89<>\"\",Score!G89,\"\")","v":""},{"$f":"IF(Score!H89<>\"\",Score!H89,\"\")","v":""},1,1,1,"",{"$f":"IF($K$4<>0,HLOOKUP($K$4,$O$4:$XFD70,ROW()-3,FALSE),\"\")","v":""},{"$f":"IF($K$4<>0,HLOOKUP(CONCATENATE($K$4,\"1\"),$O$4:$XFD70,ROW()-3,FALSE),\"\")","v":""},{"$f":"IF($K$4<>0,HLOOKUP(CONCATENATE($K$4,\"2\"),$O$4:$XFD70,ROW()-3,FALSE),\"\")","v":""},{"$nulls":3},{"$f":"IF(OR($E70=\"\",$F70=\"\",O70=\"\",P70=\"\"),\"\",IF(AND(O70=$E70,P70=$F70),Reglement!$S$3*$J70,IF(SIGN($E70-$F70)=SIGN(O70-P70),Reglement!$S$4*$J70,0))*IF(AND($E70+$F70>=6,O70+P70>=6),Reglement!$S$29,IF(AND($E70+$F70>=4,O70+P70>=4),Reglement!$S$28,1)))","v":""}]
[null,null,{"$f":"Score!F90","v":"Leicester City"},{"$f":"Score!I90","v":"Newcastle"},{"$f":"IF(Score!G90<>\"\",Score!G90,\"\")","v":""},{"$f":"IF(Score!H90<>\"\",Score!H90,\"\")","v":""},1,1,1,"",{"$f":"IF($K$4<>0,HLOOKUP($K$4,$O$4:$XFD71,ROW()-3,FALSE),\"\")","v":""},{"$f":"IF($K$4<>0,HLOOKUP(CONCATENATE($K$4,\"1\"),$O$4:$XFD71,ROW()-3,FALSE),\"\")","v":""},{"$f":"IF($K$4<>0,HLOOKUP(CONCATENATE($K$4,\"2\"),$O$4:$XFD71,ROW()-3,FALSE),\"\")","v":""},{"$nulls":3},{"$f":"IF(OR($E71=\"\",$F71=\"\",O71=\"\",P71=\"\"),\"\",IF(AND(O71=$E71,P71=$F71),Reglement!$S$3*$J71,IF(SIGN($E71-$F71)=SIGN(O71-P71),Reglement!$S$4*$J71,0))*IF(AND($E71+$F71>=6,O71+P71>=6),Reglement!$S$29,IF(AND($E71+$F71>=4,O71+P71>=4),Reglement!$S$28,1)))","v":""}]
[null,null,{"$f":"Score!F91","v":"Manchester United"},{"$f":"Score!I91","v":"Arsenal"},{"$f":"IF(Score!G91<>\"\",Score!G91,\"\")","v":""},{"$f":"IF(Score!H91<>\"\",Score!H91,\"\")","v":""},1,1,1,"",{"$f":"IF($K$4<>0,HLOOKUP($K$4,$O$4:$XFD72,ROW()-3,FALSE),\"\")","v":""},{"$f":"IF($K$4<>0,HLOOKUP(CONCATENATE($K$4,\"1\"),$O$4:$XFD72,ROW()-3,FALSE),\"\")","v":""},{"$f":"IF($K$4<>0,HLOOKUP(CONCATENATE($K$4,\"2\"),$O$4:$XFD72,ROW()-3,FALSE),\"\")","v":""},{"$nulls":3},{"$f":"IF(OR($E72=\"\",$F72=\"\",O72=\"\",P72=\"\"),\"\",IF(AND(O72=$E72,P72=$F72),Reglement!$S$3*$J72,IF(SIGN($E72-$F72)=SIGN(O72-P72),Reglement!$S$4*$J72,0))*IF(AND($E72+$F72>=6,O72+P72>=6),Reglement!$S$29,IF(AND($E72+$F72>=4,O72+P72>=4),Reglement!$S$28,1)))","v":""}]
[null,null,{"$f":"Score!F92","v":"Sheffield United"},{"$f":"Score!I92","v":"Liverpool"},{"$f":"IF(Score!G92<>\"\",Score!G92,\"\")","v":""},{"$f":"IF(Score!H92<>\"\",Score!H92,\"\")","v":""},1,1,1,{"$f":"IF(OR(E73=\"\",F73=\"\"),\"\",IF(E73>F73,G73,IF(E73=F73,H73,I73)))","v":""},{"$f":"IF($K$4<>0,HLOOKUP($K$4,$O$4:$XFD73,ROW()-3,FALSE),\"\")","v":""},{"$f":"IF($K$4<>0,HLOOKUP(CONCATENATE($K$4,\"1\"),$O$4:$XFD73,ROW()-3,FALSE),\"\")","v":""},{"$f":"IF($K$4<>0,HLOOKUP(CONCATENATE($K$4,\"2\"),$O$4:$XFD73,ROW()-3,FALSE),\"\")","v":""},{"$nulls":3},{"$f":"IF(OR($E73=\"\",$F73=\"\",O73=\"\",P73=\"\"),\"\",IF(AND(O73=$E73,P73=$F73),Reglement!$S$3*$J73,IF(SIGN($E73-$F73)=SIGN(O73-P73),Reglement!$S$4*$J73,0))*IF(AND($E73+$F73>=6,O73+P73>=6),Reglement!$S$29,IF(AND($E73+$F73>=4,O73+P73>=4),Reglement!$S$28,1)))","v":""}]
[null,null,{"$f":"Score!F93","v":"Tottenham"},{"$f":"Score!I93","v":"Southampton"},{"$f":"IF(Score!G93<>\"\",Score!G93,\"\")","v":""},{"$f":"IF(Score!H93<>\"\",Score!H93,\"\")","v":""},1,1,1,"",{"$f":"IF($K$4<>0,HLOOKUP($K$4,$O$4:$XFD74,ROW()-3,FALSE),\"\")","v":""},{"$f":"IF($K$4<>0,HLOOKUP(CONCATENATE($K$4,\"1\"),$O$4:$XFD74,ROW()-3,FALSE),\"\")","v":""},{"$f":"IF($K$4<>0,HLOOKUP(CONCATENATE($K$4,\"2\"),$O$4:$XFD74,ROW()-3,FALSE),\"\")","v":""},{"$nulls":3},{"$f":"IF(OR($E74=\"\",$F74=\"\",O74=\"\",P74=\"\"),\"\",IF(AND(O74=$E74,P74=$F74),Reglement!$S$3*$J74,IF(SIGN($E74-$F74)=SIGN(O74-P74),Reglement!$S$4*$J74,0))*IF(AND($E74+$F74>=6,O74+P74>=6),Reglement!$S$29,IF(AND($E74+$F74>=4,O74+P74>=4),Reglement!$S$28,1)))","v":""}]
[null,null,{"$f":"Score!F94","v":"Wolverhampton"},{"$f":"Score!I94","v":"Watford"},{"$f":"IF(Score!G94<>\"\",Score!G94,\"\")","v":""},{"$f":"IF(Score!H94<>\"\",Score!H94,\"\")","v":""},1,1,1,"",{"$f":"IF($K$4<>0,HLOOKUP($K$4,$O$4:$XFD75,ROW()-3,FALSE),\"\")","v":""},{"$f":"IF($K$4<>0,HLOOKUP(CONCATENATE($K$4,\"1\"),$O$4:$XFD75,ROW()-3,FALSE),\"\")","v":""},{"$f":"IF($K$4<>0,HLOOKUP(CONCATENATE($K$4,\"2\"),$O$4:$XFD75,ROW()-3,FALSE),\"\")","v":""},{"$nulls":3},{"$f":"IF(OR($E75=\"\",$F75=\"\",O75=\"\",P75=\"\"),\"\",IF(AND(O75=$E75,P75=$F75),Reglement!$S$3*$J75,IF(SIGN($E75-$F75)=SIGN(O75-P75),Reglement!$S$4*$J75,0))*IF(AND($E75+$F75>=6,O75+P75>=6),Reglement!$S$29,IF(AND($E75+$F75>=4,O75+P75>=4),Reglement!$S$28,1)))","v":""}]
["JOURNEE n°8",null,{"$f":"Score!F98","v":"Arsenal"},{"$f":"Score!I98","v":"Bournemouth"},{"$f":"IF(Score!G98<>\"\",Score!G98,\"\")","v":""},{"$f":"IF(Score!H98<>\"\",Score!H98,\"\")","v":""},1,1,1,"",{"$f":"IF($K$4<>0,HLOOKUP($K$4,$O$4:$XFD76,ROW()-3,FALSE),\"\")","v":""},{"$f":"IF($K$4<>0,HLOOKUP(CONCATENATE($K$4,\"1\"),$O$4:$XFD76,ROW()-3,FALSE),\"\")","v":""},{"$f":"IF($K$4<>0,HLOOKUP(CONCATENATE($K$4,\"2\"),$O$4:$XFD76,ROW()-3,FALSE),\"\")","v":""},{"$nulls":3},{"$f":"IF(OR($E76=\"\",$F76=\"\",O76=\"\",P76=\"\"),\"\",IF(AND(O76=$E76,P76=$F76),Reglement!$S$3*$J76,IF(SIGN($E76-$F76)=SIGN(O76-P76),Reglement!$S$4*$J76,0))*IF(AND($E76+$F76>=6,O76+P76>=6),Reglement!$S$29,IF(AND($E76+$F76>=4,O76+P76>=4),Reglement!$S$28,1)))","v":""}]
[null,null,{"$f":"Score!F99","v":"Brighton"},{"$f":"Score!I99","v":"Tottenham"},{"$f":"IF(Score!G99<>\"\",Score!G99,\"\")","v":""},{"$f":"IF(Score!H99<>\"\",Score!H99,\"\")","v":""},1,1,1,"",{"$f":"IF($K$4<>0,HLOOKUP($K$4,$O$4:$XFD77,ROW()-3,FALSE),\"\")","v":""},{"$f":"IF($K$4<>0,HLOOKUP(CONCATENATE($K$4,\"1\"),$O$4:$XFD77,ROW()-3,FALSE),\"\")","v":""},{"$f":"IF($K$4<>0,HLOOKUP(CONCATENATE($K$4,\"2\"),$O$4:$XFD77,ROW()-3,FALSE),\"\")","v":""},{"$nulls":3},{"$f":"IF(OR($E77=\"\",$F77=\"\",O77=\"\",P77=\"\"),\"\",IF(AND(O77=$E77,P77=$F77),Reglement!$S$3*$J77,IF(SIGN($E77-$F77)=SIGN(O77-P77),Reglement!$S$4*$J77,0))*IF(AND($E77+$F77>=6,O77+P77>=6),Reglement!$S$29,IF(AND($E77+$F77>=4,O77+P77>=4),Reglement!$S$28,1)))","v":""}]
[null,null,{"$f":"Score!F100","v":"Burnley"},{"$f":"Score!I100","v":"Everton"},{"$f":"IF(Score!G100<>\"\",Score!G100,\"\")","v":""},{"$f":"IF(Score!H100<>\"\",Score!H100,\"\")","v":""},1,1,1,"",{"$f":"IF($K$4<>0,HLOOKUP($K$4,$O$4:$XFD78,ROW()-3,FALSE),\"\")","v":""},{"$f":"IF($K$4<>0,HLOOKUP(CONCATENATE($K$4,\"1\"),$O$4:$XFD78,ROW()-3,FALSE),\"\")","v":""},{"$f":"IF($K$4<>0,HLOOKUP(CONCATENATE($K$4,\"2\"),$O$4:$XFD78,ROW()-3,FALSE),\"\")","v":""},{"$nulls":3},{"$f":"IF(OR($E78=\"\",$F78=\"\",O78=\"\",P78=\"\"),\"\",IF(AND(O78=$E78,P78=$F78),Reglement!$S$3*$J78,IF(SIGN($E78-$F78)=SIGN(O78-P78),Reglement!$S$4*$J78,0))*IF(AND($E78+$F78>=6,O78+P78>=6),Reglement!$S$29,IF(AND($E78+$F78>=4,O78+P78>=4),Reglement!$S$28,1)))","v":""}]
[null,null,{"$f":"Score!F101","v":"Liverpool"},{"$f":"Score!I101","v":"Leicester City"},{"$f":"IF(Score!G101<>\"\",Score!G101,\"\")","v":""},{"$f":"IF(Score!H101<>\"\",Score!H101,\"\")","v":""},1,1,1,"",{"$f":"IF($K$4<>0,HLOOKUP($K$4,$O$4:$XFD79,ROW()-3,FALSE),\"\")","v":""},{"$f":"IF($K$4<>0,HLOOKUP(CONCATENATE($K$4,\"1\"),$O$4:$XFD79,ROW()-3,FALSE),\"\")","v":""},{"$f":"IF($K$4<>0,HLOOKUP(CONCATENATE($K$4,\"2\"),$O$4:$XFD79,ROW()-3,FALSE),\"\")","v":""},{"$nulls":3},{"$f":"IF(OR($E79=\"\",$F79=\"\",O79=\"\",P79=\"\"),\"\",IF(AND(O79=$E79,P79=$F79),Reglement!$S$3*$J79,IF(SIGN($E79-$F79)=SIGN(O79-P79),Reglement!$S$4*$J79,0))*IF(AND($E79+$F79>=6,O79+P79>=6),Reglement!$S$29,IF(AND($E79+$F79>=4,O79+P79>=4),Reglement!$S$28,1)))","v":""}]
[null,null,{"$f":"Score!F102","v":"Manchester City"},{"$f":"Score!I102","v":"Wolverhampton"},{"$f":"IF(Score!G102<>\"\",Score!G102,\"\")","v":""},{"$f":"IF(Score!H102<>\"\",Score!H102,\"\")","v":""},1,1,1,"",{"$f":"IF($K$4<>0,HLOOKUP($K$4,$O$4:$XFD80,ROW()-3,FALSE),\"\")","v":""},{"$f":"IF($K$4<>0,HLOOKUP(CONCATENATE($K$4,\"1\"),$O$4:$XFD80,ROW()-3,FALSE),\"\")","v":""},{"$f":"IF($K$4<>0,HLOOKUP(CONCATENATE($K$4,\"2\"),$O$4:$XFD80,ROW()-3,FALSE),\"\")","v":""},{"$nulls":3},{"$f":"IF(OR($E80=\"\",$F80=\"\",O80=\"\",P80=\"\"),\"\",IF(AND(O80=$E80,P80=$F80),Reglement!$S$3*$J80,IF(SIGN($E80-$F80)=SIGN(O80-P80),Reglement!$S$4*$J80,0))*IF(AND($E80+$F80>=6,O80+P80>=6),Reglement!$S$29,IF(AND($E80+$F80>=4,O80+P80>=4),Reglement!$S$28,1)))","v":""}]
[null,null,{"$f":"Score!F103","v":"Newcastle"},{"$f":"Score!I103","v":"Manchester United"},{"$f":"IF(Score!G103<>\"\",Score!G103,\"\")","v":""},{"$f":"IF(Score!H103<>\"\",Score!H103,\"\")","v":""},1,1,1,"",{"$f":"IF($K$4<>0,HLOOKUP($K$4,$O$4:$XFD81,ROW()-3,FALSE),\"\")","v":""},{"$f":"IF($K$4<>0,HLOOKUP(CONCATENATE($K$4,\"1\"),$O$4:$XFD81,ROW()-3,FALSE),\"\")","v":""},{"$f":"IF($K$4<>0,HLOOKUP(CONCATENATE($K$4,\"2\"),$O$4:$XFD81,ROW()-3,FALSE),\"\")","v":""},{"$nulls":3},{"$f":"IF(OR($E81=\"\",$F81=\"\",O81=\"\",P81=\"\"),\"\",IF(AND(O81=$E81,P81=$F81),Reglement!$S$3*$J81,IF(SIGN($E81-$F81)=SIGN(O81-P81),Reglement!$S$4*$J81,0))*IF(AND($E81+$F81>=6,O81+P81>=6),Reglement!$S$29,IF(AND($E81+$F81>=4,O81+P81>=4),Reglement!$S$28,1)))","v":""}]
[null,null,{"$f":"Score!F104","v":"Norwich"},{"$f":"Score!I104","v":"Aston Villa"},{"$f":"IF(Score!G104<>\"\",Score!G104,\"\")","v":""},{"$f":"IF(Score!H104<>\"\",Score!H104,\"\")","v":""},1,1,1,"",{"$f":"IF($K$4<>0,HLOOKUP($K$4,$O$4:$XFD82,ROW()-3,FALSE),\"\")","v":""},{"$f":"IF($K$4<>0,HLOOKUP(CONCATENATE($K$4,\"1\"),$O$4:$XFD82,ROW()-3,FALSE),\"\")","v":""},{"$f":"IF($K$4<>0,HLOOKUP(CONCATENATE($K$4,\"2\"),$O$4:$XFD82,ROW()-3,FALSE),\"\")","v":""},{"$nulls":3},{"$f":"IF(OR($E82=\"\",$F82=\"\",O82=\"\",P82=\"\"),\"\",IF(AND(O82=$E82,P82=$F82),Reglement!$S$3*$J82,IF(SIGN($E82-$F82)=SIGN(O82-P82),Reglement!$S$4*$J82,0))*IF(AND($E82+$F82>=6,O82+P82>=6),Reglement!$S$29,IF(AND($E82+$F82>=4,O82+P82>=4),Reglement!$S$28,1)))","v":""}]
[null,null,{"$f":"Score!F105","v":"Southampton"},{"$f":"Score!I105","v":"Chelsea"},{"$f":"IF(Score!G105<>\"\",Score!G105,\"\")","v":""},{"$f":"IF(Score!H105<>\"\",Score!H105,\"\")","v":""},1,1,1,"",{"$f":"IF($K$4<>0,HLOOKUP($K$4,$O$4:$XFD83,ROW()-3,FALSE),\"\")","v":""},{"$f":"IF($K$4<>0,HLOOKUP(CONCATENATE($K$4,\"1\"),$O$4:$XFD83,ROW()-3,FALSE),\"\")","v":""},{"$f":"IF($K$4<>0,HLOOKUP(CONCATENATE($K$4,\"2\"),$O$4:$XFD83,ROW()-3,FALSE),\"\")","v":""},{"$nulls":3},{"$f":"IF(OR($E83=\"\",$F83=\"\",O83=\"\",P83=\"\"),\"\",IF(AND(O83=$E83,P83=$F83),Reglement!$S$3*$J83,IF(SIGN($E83-$F83)=SIGN(O83-P83),Reglement!$S$4*$J83,0))*IF(AND($E83+$F83>=6,O83+P83>=6),Reglement!$S$29,IF(AND($E83+$F83>=4,O83+P83>=4),Reglement!$S$28,1)))","v":""}]
[null,null,{"$f":"Score!F106","v":"Watford"},{"$f":"Score!I106","v":"Sheffield United"},{"$f":"IF(Score!G106<>\"\",Score!G106,\"\")","v":""},{"$f":"IF(Score!H106<>\"\",Score!H106,\"\")","v":""},1,1,1,"",{"$f":"IF($K$4<>0,HLOOKUP($K$4,$O$4:$XFD84,ROW()-3,FALSE),\"\")","v":""},{"$f":"IF($K$4<>0,HLOOKUP(CONCATENATE($K$4,\"1\"),$O$4:$XFD84,ROW()-3,FALSE),\"\")","v":""},{"$f":"IF($K$4<>0,HLOOKUP(CONCATENATE($K$4,\"2\"),$O$4:$XFD84,ROW()-3,FALSE),\"\")","v":""},{"$nulls":3},{"$f":"IF(OR($E84=\"\",$F84=\"\",O84=\"\",P84=\"\"),\"\",IF(AND(O84=$E84,P84=$F84),Reglement!$S$3*$J84,IF(SIGN($E84-$F84)=SIGN(O84-P84),Reglement!$S$4*$J84,0))*IF(AND($E84+$F84>=6,O84+P84>=6),Reglement!$S$29,IF(AND($E84+$F84>=4,O84+P84>=4),Reglement!$S$28,1)))","v":""}]
[null,null,{"$f":"Score!F107","v":"West Ham"},{"$f":"Score!I107","v":"Crystal Palace"},{"$f":"IF(Score!G107<>\"\",Score!G107,\"\")","v":""},{"$f":"IF(Score!H107<>\"\",Score!H107,\"\")","v":""},1,1,1,"",{"$f":"IF($K$4<>0,HLOOKUP($K$4,$O$4:$XFD85,ROW()-3,FALSE),\"\")","v":""},{"$f":"IF($K$4<>0,HLOOKUP(CONCATENATE($K$4,\"1\"),$O$4:$XFD85,ROW()-3,FALSE),\"\")","v":""},{"$f":"IF($K$4<>0,HLOOKUP(CONCATENATE($K$4,\"2\"),$O$4:$XFD85,ROW()-3,FALSE),\"\")","v":""},{"$nulls":3},{"$f":"IF(OR($E85=\"\",$F85=\"\",O85=\"\",P85=\"\"),\"\",IF(AND(O85=$E85,P85=$F85),Reglement!$S$3*$J85,IF(SIGN($E85-$F85)=SIGN(O85-P85),Reglement!$S$4*$J85,0))*IF(AND($E85+$F85>=6,O85+P85>=6),Reglement!$S$29,IF(AND($E85+$F85>=4,O85+P85>=4),Reglement!$S$28,1)))","v":""}]
["JOURNEE n°9",null,{"$f":"Score!F111","v":"Bournemouth"},{"$f":"Score!I111","v":"Norwich"},{"$f":"IF(Score!G111<>\"\",Score!G111,\"\")","v":""},{"$f":"IF(Score!H111<>\"\",Score!H111,\"\")","v":""},1,1,1,"",{"$f":"IF($K$4<>0,HLOOKUP($K$4,$O$4:$XFD86,ROW()-3,FALSE),\"\")","v":""},{"$f":"IF($K$4<>0,HLOOKUP(CONCATENATE($K$4,\"1\"),$O$4:$XFD86,ROW()-3,FALSE),\"\")","v":""},{"$f":"IF($K$4<>0,HLOOKUP(CONCATENATE($K$4,\"2\"),$O$4:$XFD86,ROW()-3,FALSE),\"\")","v":""},{"$nulls":3},{"$f":"IF(OR($E86=\"\",$F86=\"\",O86=\"\",P86=\"\"),\"\",IF(AND(O86=$E86,P86=$F86),Reglement!$S$3*$J86,IF(SIGN($E86-$F86)=SIGN(O86-P86),Reglement!$S$4*$J86,0))*IF(AND($E86+$F86>=6,O86+P86>=6),Reglement!$S$29,IF(AND($E86+$F86>=4,O86+P86>=4),Reglement!$S$28,1)))","v":""}]
[null,null,{"$f":"Score!F112","v":"Aston Villa"},{"$f":"Score!I112","v":"Brighton"},{"$f":"IF(Score!G112<>\"\",Score!G112,\"\")","v":""},{"$f":"IF(Score!H112<>\"\",Score!H112,\"\")","v":""},1,1,1,"",{"$f":"IF($K$4<>0,HLOOKUP($K$4,$O$4:$XFD87,ROW()-3,FALSE),\"\")","v":""},{"$f":"IF($K$4<>0,HLOOKUP(CONCATENATE($K$4,\"1\"),$O$4:$XFD87,ROW()-3,FALSE),\"\")","v":""},{"$f":"IF($K$4<>0,HLOOKUP(CONCATENATE($K$4,\"2\"),$O$4:$XFD87,ROW()-3,FALSE),\"\")","v":""},{"$nulls":3},{"$f":"IF(OR($E87=\"\",$F87=\"\",O87=\"\",P87=\"\"),\"\",IF(AND(O87=$E87,P87=$F87),Reglement!$S$3*$J87,IF(SIGN($E87-$F87)=SIGN(O87-P87),Reglement!$S$4*$J87,0))*IF(AND($E87+$F87>=6,O87+P87>=6),Reglement!$S$29,IF(AND($E87+$F87>=4,O87+P87>=4),Reglement!$S$28,1)))","v":""}]
[null,null,{"$f":"Score!F113","v":"Chelsea"},{"$f":"Score!I113","v":"Newcastle"},{"$f":"IF(Score!G113<>\"\",Score!G113,\"\")","v":""},{"$f":"IF(Score!H113<>\"\",Score!H113,\"\")","v":""},1,1,1,"",{"$f":"IF($K$4<>0,HLOOKUP($K$4,$O$4:$XFD88,ROW()-3,FALSE),\"\")","v":""},{"$f":"IF($K$4<>0,HLOOKUP(CONCATENATE($K$4,\"1\"),$O$4:$XFD88,ROW()-3,FALSE),\"\")","v":""},{"$f":"IF($K$4<>0,HLOOKUP(CONCATENATE($K$4,\"2\"),$O$4:$XFD88,ROW()-3,FALSE),\"\")","v":""},{"$nulls":3},{"$f":"IF(OR($E88=\"\",$F88=\"\",O88=\"\",P88=\"\"),\"\",IF(AND(O88=$E88,P88=$F88),Reglement!$S$3*$J88,IF(SIGN($E88-$F88)=SIGN(O88-P88),Reglement!$S$4*$J88,0))*IF(AND($E88+$F88>=6,O88+P88>=6),Reglement!$S$29,IF(AND($E88+$F88>=4,O88+P88>=4),Reglement!$S$28,1)))","v":""}]
[null,null,{"$f":"Score!F114","v":"Crystal Palace"},{"$f":"Score!I114","v":"Manchester City"},{"$f":"IF(Score!G114<>\"\",Score!G114,\"\")","v":""},{"$f":"IF(Score!H114<>\"\",Score!H114,\"\")","v":""},1,1,1,"",{"$f":"IF($K$4<>0,HLOOKUP($K$4,$O$4:$XFD89,ROW()-3,FALSE),\"\")","v":""},{"$f":"IF($K$4<>0,HLOOKUP(CONCATENATE($K$4,\"1\"),$O$4:$XFD89,ROW()-3,FALSE),\"\")","v":""},{"$f":"IF($K$4<>0,HLOOKUP(CONCATENATE($K$4,\"2\"),$O$4:$XFD89,ROW()-3,FALSE),\"\")","v":""},{"$nulls":3},{"$f":"IF(OR($E89=\"\",$F89=\"\",O89=\"\",P89=\"\"),\"\",IF(AND(O89=$E89,P89=$F89),Reglement!$S$3*$J89,IF(SIGN($E89-$F89)=SIGN(O89-P89),Reglement!$S$4*$J89,0))*IF(AND($E89+$F89>=6,O89+P89>=6),Reglement!$S$29,IF(AND($E89+$F89>=4,O89+P89>=4),Reglement!$S$28,1)))","v":""}]
[null,null,{"$f":"Score!F115","v":"Everton"},{"$f":"Score!I115","v":"West Ham"},{"$f":"IF(Score!G115<>\"\",Score!G115,\"\")","v":""},{"$f":"IF(Score!H115<>\"\",Score!H115,\"\")","v":""},1,1,1,"",{"$f":"IF($K$4<>0,HLOOKUP($K$4,$O$4:$XFD90,ROW()-3,FALSE),\"\")","v":""},{"$f":"IF($K$4<>0,HLOOKUP(CONCATENATE($K$4,\"1\"),$O$4:$XFD90,ROW()-3,FALSE),\"\")","v":""},{"$f":"IF($K$4<>0,HLOOKUP(CONCATENATE($K$4,\"2\"),$O$4:$XFD90,ROW()-3,FALSE),\"\")","v":""},{"$nulls":3},{"$f":"IF(OR($E90=\"\",$F90=\"\",O90=\"\",P90=\"\"),\"\",IF(AND(O90=$E90,P90=$F90),Reglement!$S$3*$J90,IF(SIGN($E90-$F90)=SIGN(O90-P90),Reglement!$S$4*$J90,0))*IF(AND($E90+$F90>=6,O90+P90>=6),Reglement!$S$29,IF(AND($E90+$F90>=4,O90+P90>=4),Reglement!$S$28,1)))","v":""}]
[null,null,{"$f":"Score!F116","v":"Leicester City"},{"$f":"Score!I116","v":"Burnley"},{"$f":"IF(Score!G116<>\"\",Score!G116,\"\")","v":""},{"$f":"IF(Score!H116<>\"\",Score!H116,\"\")","v":""},1,1,1,{"$f":"IF(OR(E91=\"\",F91=\"\"),\"\",IF(E91>F91,G91,IF(E91=F91,H91,I91)))","v":""},{"$f":"IF($K$4<>0,HLOOKUP($K$4,$O$4:$XFD91,ROW()-3,FALSE),\"\")","v":""},{"$f":"IF($K$4<>0,HLOOKUP(CONCATENATE($K$4,\"1\"),$O$4:$XFD91,ROW()-3,FALSE),\"\")","v":""},{"$f":"IF($K$4<>0,HLOOKUP(CONCATENATE($K$4,\"2\"),$O$4:$XFD91,ROW()-3,FALSE),\"\")","v":""},{"$nulls":3},{"$f":"IF(OR($E91=\"\",$F91=\"\",O91=\"\",P91=\"\"),\"\",IF(AND(O91=$E91,P91=$F91),Reglement!$S$3*$J91,IF(SIGN($E91-$F91)=SIGN(O91-P91),Reglement!$S$4*$J91,0))*IF(AND($E91+$F91>=6,O91+P91>=6),Reglement!$S$29,IF(AND($E91+$F91>=4,O91+P91>=4),Reglement!$S$28,1)))","v":""}]
[null,null,{"$f":"Score!F117","v":"Manchester United"},{"$f":"Score!I117","v":"Liverpool"},{"$f":"IF(Score!G117<>\"\",Score!G117,\"\")","v":""},{"$f":"IF(Score!H117<>\"\",Score!H117,\"\")","v":""},1,1,1,"",{"$f":"IF($K$4<>0,HLOOKUP($K$4,$O$4:$XFD92,ROW()-3,FALSE),\"\")","v":""},{"$f":"IF($K$4<>0,HLOOKUP(CONCATENATE($K$4,\"1\"),$O$4:$XFD92,ROW()-3,FALSE),\"\")","v":""},{"$f":"IF($K$4<>0,HLOOKUP(CONCATENATE($K$4,\"2\"),$O$4:$XFD92,ROW()-3,FALSE),\"\")","v":""},{"$nulls":3},{"$f":"IF(OR($E92=\"\",$F92=\"\",O92=\"\",P92=\"\"),\"\",IF(AND(O92=$E92,P92=$F92),Reglement!$S$3*$J92,IF(SIGN($E92-$F92)=SIGN(O92-P92),Reglement!$S$4*$J92,0))*IF(AND($E92+$F92>=6,O92+P92>=6),Reglement!$S$29,IF(AND($E92+$F92>=4,O92+P92>=4),Reglement!$S$28,1)))","v":""}]
[null,null,{"$f":"Score!F118","v":"Sheffield United"},{"$f":"Score!I118","v":"Arsenal"},{"$f":"IF(Score!G118<>\"\",Score!G118,\"\")","v":""},{"$f":"IF(Score!H118<>\"\",Score!H118,\"\")","v":""},1,1,1,"",{"$f":"IF($K$4<>0,HLOOKUP($K$4,$O$4:$XFD93,ROW()-3,FALSE),\"\")","v":""},{"$f":"IF($K$4<>0,HLOOKUP(CONCATENATE($K$4,\"1\"),$O$4:$XFD93,ROW()-3,FALSE),\"\")","v":""},{"$f":"IF($K$4<>0,HLOOKUP(CONCATENATE($K$4,\"2\"),$O$4:$XFD93,ROW()-3,FALSE),\"\")","v":""},{"$nulls":3},{"$f":"IF(OR($E93=\"\",$F93=\"\",O93=\"\",P93=\"\"),\"\",IF(AND(O93=$E93,P93=$F93),Reglement!$S$3*$J93,IF(SIGN($E93-$F93)=SIGN(O93-P93),Reglement!$S$4*$J93,0))*IF(AND($E93+$F93>=6,O93+P93>=6),Reglement!$S$29,IF(AND($E93+$F93>=4,O93+P93>=4),Reglement!$S$28,1)))","v":""}]
[null,null,{"$f":"Score!F119","v":"Tottenham"},{"$f":"Score!I119","v":"Watford"},{"$f":"IF(Score!G119<>\"\",Score!G119,\"\")","v":""},{"$f":"IF(Score!H119<>\"\",Score!H119,\"\")","v":""},1,1,1,"",{"$f":"IF($K$4<>0,HLOOKUP($K$4,$O$4:$XFD94,ROW()-3,FALSE),\"\")","v":""},{"$f":"IF($K$4<>0,HLOOKUP(CONCATENATE($K$4,\"1\"),$O$4:$XFD94,ROW()-3,FALSE),\"\")","v":""},{"$f":"IF($K$4<>0,HLOOKUP(CONCATENATE($K$4,\"2\"),$O$4:$XFD94,ROW()-3,FALSE),\"\")","v":""},{"$nulls":3},{"$f":"IF(OR($E94=\"\",$F94=\"\",O94=\"\",P94=\"\"),\"\",IF(AND(O94=$E94,P94=$F94),Reglement!$S$3*$J94,IF(SIGN($E94-$F94)=SIGN(O94-P94),Reglement!$S$4*$J94,0))*IF(AND($E94+$F94>=6,O94+P94>=6),Reglement!$S$29,IF(AND($E94+$F94>=4,O94+P94>=4),Reglement!$S$28,1)))","v":""}]
[null,null,{"$f":"Score!F120","v":"Wolverhampton"},{"$f":"Score!I120","v":"Southampton"},{"$f":"IF(Score!G120<>\"\",Score!G120,\"\")","v":""},{"$f":"IF(Score!H120<>\"\",Score!H120,\"\")","v":""},1,1,1,"",{"$f":"IF($K$4<>0,HLOOKUP($K$4,$O$4:$XFD95,ROW()-3,FALSE),\"\")","v":""},{"$f":"IF($K$4<>0,HLOOKUP(CONCATENATE($K$4,\"1\"),$O$4:$XFD95,ROW()-3,FALSE),\"\")","v":""},{"$f":"IF($K$4<>0,HLOOKUP(CONCATENATE($K$4,\"2\"),$O$4:$XFD95,ROW()-3,FALSE),\"\")","v":""},{"$nulls":3},{"$f":"IF(OR($E95=\"\",$F95=\"\",O95=\"\",P95=\"\"),\"\",IF(AND(O95=$E95,P95=$F95),Reglement!$S$3*$J95,IF(SIGN($E95-$F95)=SIGN(O95-P95),Reglement!$S$4*$J95,0))*IF(AND($E95+$F95>=6,O95+P95>=6),Reglement!$S$29,IF(AND($E95+$F95>=4,O95+P95>=4),Reglement!$S$28,1)))","v":""}]
["JOURNEE n°10",null,{"$f":"Score!F124","v":"Arsenal"},{"$f":"Score!I124","v":"Crystal Palace"},{"$f":"IF(Score!G124<>\"\",Score!G124,\"\")","v":""},{"$f":"IF(Score!H124<>\"\",Score!H124,\"\")","v":""},1,1,1,"",{"$f":"IF($K$4<>0,HLOOKUP($K$4,$O$4:$XFD96,ROW()-3,FALSE),\"\")","v":""},{"$f":"IF($K$4<>0,HLOOKUP(CONCATENATE($K$4,\"1\"),$O$4:$XFD96,ROW()-3,FALSE),\"\")","v":""},{"$f":"IF($K$4<>0,HLOOKUP(CONCATENATE($K$4,\"2\"),$O$4:$XFD96,ROW()-3,FALSE),\"\")","v":""},{"$nulls":3},{"$f":"IF(OR($E96=\"\",$F96=\"\",O96=\"\",P96=\"\"),\"\",IF(AND(O96=$E96,P96=$F96),Reglement!$S$3*$J96,IF(SIGN($E96-$F96)=SIGN(O96-P96),Reglement!$S$4*$J96,0))*IF(AND($E96+$F96>=6,O96+P96>=6),Reglement!$S$29,IF(AND($E96+$F96>=4,O96+P96>=4),Reglement!$S$28,1)))","v":""}]
[null,null,{"$f":"Score!F125","v":"Brighton"},{"$f":"Score!I125","v":"Everton"},{"$f":"IF(Score!G125<>\"\",Score!G125,\"\")","v":""},{"$f":"IF(Score!H125<>\"\",Score!H125,\"\")","v":""},1,1,1,"",{"$f":"IF($K$4<>0,HLOOKUP($K$4,$O$4:$XFD97,ROW()-3,FALSE),\"\")","v":""},{"$f":"IF($K$4<>0,HLOOKUP(CONCATENATE($K$4,\"1\"),$O$4:$XFD97,ROW()-3,FALSE),\"\")","v":""},{"$f":"IF($K$4<>0,HLOOKUP(CONCATENATE($K$4,\"2\"),$O$4:$XFD97,ROW()-3,FALSE),\"\")","v":""},{"$nulls":3},{"$f":"IF(OR($E97=\"\",$F97=\"\",O97=\"\",P97=\"\"),\"\",IF(AND(O97=$E97,P97=$F97),Reglement!$S$3*$J97,IF(SIGN($E97-$F97)=SIGN(O97-P97),Reglement!$S$4*$J97,0))*IF(AND($E97+$F97>=6,O97+P97>=6),Reglement!$S$29,IF(AND($E97+$F97>=4,O97+P97>=4),Reglement!$S$28,1)))","v":""}]
[null,null,{"$f":"Score!F126","v":"Burnley"},{"$f":"Score!I126","v":"Chelsea"},{"$f":"IF(Score!G126<>\"\",Score!G126,\"\")","v":""},{"$f":"IF(Score!H126<>\"\",Score!H126,\"\")","v":""},1,1,1,"",{"$f":"IF($K$4<>0,HLOOKUP($K$4,$O$4:$XFD98,ROW()-3,FALSE),\"\")","v":""},{"$f":"IF($K$4<>0,HLOOKUP(CONCATENATE($K$4,\"1\"),$O$4:$XFD98,ROW()-3,FALSE),\"\")","v":""},{"$f":"IF($K$4<>0,HLOOKUP(CONCATENATE($K$4,\"2\"),$O$4:$XFD98,ROW()-3,FALSE),\"\")","v":""},{"$nulls":3},{"$f":"IF(OR($E98=\"\",$F98=\"\",O98=\"\",P98=\"\"),\"\",IF(AND(O98=$E98,P98=$F98),Reglement!$S$3*$J98,IF(SIGN($E98-$F98)=SIGN(O98-P98),Reglement!$S$4*$J98,0))*IF(AND($E98+$F98>=6,O98+P98>=6),Reglement!$S$29,IF(AND($E98+$F98>=4,O98+P98>=4),Reglement!$S$28,1)))","v":""}]
[null,null,{"$f":"Score!F127","v":"Liverpool"},{"$f":"Score!I127","v":"Tottenham"},{"$f":"IF(Score!G127<>\"\",Score!G127,\"\")","v":""},{"$f":"IF(Score!H127<>\"\",Score!H127,\"\")","v":""},1,1,1,"",{"$f":"IF($K$4<>0,HLOOKUP($K$4,$O$4:$XFD99,ROW()-3,FALSE),\"\")","v":""},{"$f":"IF($K$4<>0,HLOOKUP(CONCATENATE($K$4,\"1\"),$O$4:$XFD99,ROW()-3,FALSE),\"\")","v":""},{"$f":"IF($K$4<>0,HLOOKUP(CONCATENATE($K$4,\"2\"),$O$4:$XFD99,ROW()-3,FALSE),\"\")","v":""},{"$nulls":3},{"$f":"IF(OR($E99=\"\",$F99=\"\",O99=\"\",P99=\"\"),\"\",IF(AND(O99=$E99,P99=$F99),Reglement!$S$3*$J99,IF(SIGN($E99-$F99)=SIGN(O99-P99),Reglement!$S$4*$J99,0))*IF(AND($E99+$F99>=6,O99+P99>=6),Reglement!$S$29,IF(AND($E99+$F99>=4,O99+P99>=4),Reglement!$S$28,1)))","v":""}]
[null,null,{"$f":"Score!F128","v":"Manchester City"},{"$f":"Score!I128","v":"Aston Villa"},{"$f":"IF(Score!G128<>\"\",Score!G128,\"\")","v":""},{"$f":"IF(Score!H128<>\"\",Score!H128,\"\")","v":""},1,1,1,{"$f":"IF(OR(E100=\"\",F100=\"\"),\"\",IF(E100>F100,G100,IF(E100=F100,H100,I100)))","v":""},{"$f":"IF($K$4<>0,HLOOKUP($K$4,$O$4:$XFD100,ROW()-3,FALSE),\"\")","v":""},{"$f":"IF($K$4<>0,HLOOKUP(CONCATENATE($K$4,\"1\"),$O$4:$XFD100,ROW()-3,FALSE),\"\")","v":""},{"$f":"IF($K$4<>0,HLOOKUP(CONCATENATE($K$4,\"2\"),$O$4:$XFD100,ROW()-3,FALSE),\"\")","v":""},{"$nulls":3},{"$f":"IF(OR($E100=\"\",$F100=\"\",O100=\"\",P100=\"\"),\"\",IF(AND(O100=$E100,P100=$F100),Reglement!$S$3*$J100,IF(SIGN($E100-$F100)=SIGN(O100-P100),Reglement!$S$4*$J100,0))*IF(AND($E100+$F100>=6,O100+P100>=6),Reglement!$S$29,IF(AND($E100+$F100>=4,O100+P100>=4),Reglement!$S$28,1)))","v":""}]
[null,null,{"$f":"Score!F129","v":"Newcastle"},{"$f":"Score!I129","v":"Wolverhampton"},{"$f":"IF(Score!G129<>\"\",Score!G129,\"\")","v":""},{"$f":"IF(Score!H129<>\"\",Score!H129,\"\")","v":""},1,1,1,"",{"$f":"IF($K$4<>0,HLOOKUP($K$4,$O$4:$XFD101,ROW()-3,FALSE),\"\")","v":""},{"$f":"IF($K$4<>0,HLOOKUP(CONCATENATE($K$4,\"1\"),$O$4:$XFD101,ROW()-3,FALSE),\"\")","v":""},{"$f":"IF($K$4<>0,HLOOKUP(CONCATENATE($K$4,\"2\"),$O$4:$XFD101,ROW()-3,FALSE),\"\")","v":""},{"$nulls":3},{"$f":"IF(OR($E101=\"\",$F101=\"\",O101=\"\",P101=\"\"),\"\",IF(AND(O101=$E101,P101=$F101),Reglement!$S$3*$J101,IF(SIGN($E101-$F101)=SIGN(O101-P101),Reglement!$S$4*$J101,0))*IF(AND($E101+$F101>=6,O101+P101>=6),Reglement!$S$29,IF(AND($E101+$F101>=4,O101+P101>=4),Reglement!$S$28,1)))","v":""}]
[null,null,{"$f":"Score!F130","v":"Norwich"},{"$f":"Score!I130","v":"Manchester United"},{"$f":"IF(Score!G130<>\"\",Score!G130,\"\")","v":""},{"$f":"IF(Score!H130<>\"\",Score!H130,\"\")","v":""},1,1,1,"",{"$f":"IF($K$4<>0,HLOOKUP($K$4,$O$4:$XFD102,ROW()-3,FALSE),\"\")","v":""},{"$f":"IF($K$4<>0,HLOOKUP(CONCATENATE($K$4,\"1\"),$O$4:$XFD102,ROW()-3,FALSE),\"\")","v":""},{"$f":"IF($K$4<>0,HLOOKUP(CONCATENATE($K$4,\"2\"),$O$4:$XFD102,ROW()-3,FALSE),\"\")","v":""},{"$nulls":3},{"$f":"IF(OR($E102=\"\",$F102=\"\",O102=\"\",P102=\"\"),\"\",IF(AND(O102=$E102,P102=$F102),Reglement!$S$3*$J102,IF(SIGN($E102-$F102)=SIGN(O102-P102),Reglement!$S$4*$J102,0))*IF(AND($E102+$F102>=6,O102+P102>=6),Reglement!$S$29,IF(AND($E102+$F102>=4,O102+P102>=4),Reglement!$S$28,1)))","v":""}]
[null,null,{"$f":"Score!F131","v":"Southampton"},{"$f":"Score!I131","v":"Leicester City"},{"$f":"IF(Score!G131<>\"\",Score!G131,\"\")","v":""},{"$f":"IF(Score!H131<>\"\",Score!H131,\"\")","v":""},1,1,1,"",{"$f":"IF($K$4<>0,HLOOKUP($K$4,$O$4:$XFD103,ROW()-3,FALSE),\"\")","v":""},{"$f":"IF($K$4<>0,HLOOKUP(CONCATENATE($K$4,\"1\"),$O$4:$XFD103,ROW()-3,FALSE),\"\")","v":""},{"$f":"IF($K$4<>0,HLOOKUP(CONCATENATE($K$4,\"2\"),$O$4:$XFD103,ROW()-3,FALSE),\"\")","v":""},{"$nulls":3},{"$f":"IF(OR($E103=\"\",$F103=\"\",O103=\"\",P103=\"\"),\"\",IF(AND(O103=$E103,P103=$F103),Reglement!$S$3*$J103,IF(SIGN($E103-$F103)=SIGN(O103-P103),Reglement!$S$4*$J103,0))*IF(AND($E103+$F103>=6,O103+P103>=6),Reglement!$S$29,IF(AND($E103+$F103>=4,O103+P103>=4),Reglement!$S$28,1)))","v":""}]
[null,null,{"$f":"Score!F132","v":"Watford"},{"$f":"Score!I132","v":"Bournemouth"},{"$f":"IF(Score!G132<>\"\",Score!G132,\"\")","v":""},{"$f":"IF(Score!H132<>\"\",Score!H132,\"\")","v":""},1,1,1,"",{"$f":"IF($K$4<>0,HLOOKUP($K$4,$O$4:$XFD104,ROW()-3,FALSE),\"\")","v":""},{"$f":"IF($K$4<>0,HLOOKUP(CONCATENATE($K$4,\"1\"),$O$4:$XFD104,ROW()-3,FALSE),\"\")","v":""},{"$f":"IF($K$4<>0,HLOOKUP(CONCATENATE($K$4,\"2\"),$O$4:$XFD104,ROW()-3,FALSE),\"\")","v":""},{"$nulls":3},{"$f":"IF(OR($E104=\"\",$F104=\"\",O104=\"\",P104=\"\"),\"\",IF(AND(O104=$E104,P104=$F104),Reglement!$S$3*$J104,IF(SIGN($E104-$F104)=SIGN(O104-P104),Reglement!$S$4*$J104,0))*IF(AND($E104+$F104>=6,O104+P104>=6),Reglement!$S$29,IF(AND($E104+$F104>=4,O104+P104>=4),Reglement!$S$28,1)))","v":""}]
[null,null,{"$f":"Score!F133","v":"West Ham"},{"$f":"Score!I133","v":"Sheffield United"},{"$f":"IF(Score!G133<>\"\",Score!G133,\"\")","v":""},{"$f":"IF(Score!H133<>\"\",Score!H133,\"\")","v":""},1,1,1,"",{"$f":"IF($K$4<>0,HLOOKUP($K$4,$O$4:$XFD105,ROW()-3,FALSE),\"\")","v":""},{"$f":"IF($K$4<>0,HLOOKUP(CONCATENATE($K$4,\"1\"),$O$4:$XFD105,ROW()-3,FALSE),\"\")","v":""},{"$f":"IF($K$4<>0,HLOOKUP(CONCATENATE($K$4,\"2\"),$O$4:$XFD105,ROW()-3,FALSE),\"\")","v":""},{"$nulls":3},{"$f":"IF(OR($E105=\"\",$F105=\"\",O105=\"\",P105=\"\"),\"\",IF(AND(O105=$E105,P105=$F105),Reglement!$S$3*$J105,IF(SIGN($E105-$F105)=SIGN(O105-P105),Reglement!$S$4*$J105,0))*IF(AND($E105+$F105>=6,O105+P105>=6),Reglement!$S$29,IF(AND($E105+$F105>=4,O105+P105>=4),Reglement!$S$28,1)))","v":""}]
["JOURNEE n°11",null,{"$f":"Score!F137","v":"Bournemouth"},{"$f":"Score!I137","v":"Manchester United"},{"$f":"IF(Score!G137<>\"\",Score!G137,\"\")","v":""},{"$f":"IF(Score!H137<>\"\",Score!H137,\"\")","v":""},1,1,1,"",{"$f":"IF($K$4<>0,HLOOKUP($K$4,$O$4:$XFD106,ROW()-3,FALSE),\"\")","v":""},{"$f":"IF($K$4<>0,HLOOKUP(CONCATENATE($K$4,\"1\"),$O$4:$XFD106,ROW()-3,FALSE),\"\")","v":""},{"$f":"IF($K$4<>0,HLOOKUP(CONCATENATE($K$4,\"2\"),$O$4:$XFD106,ROW()-3,FALSE),\"\")","v":""},{"$nulls":3},{"$f":"IF(OR($E106=\"\",$F106=\"\",O106=\"\",P106=\"\"),\"\",IF(AND(O106=$E106,P106=$F106),Reglement!$S$3*$J106,IF(SIGN($E106-$F106)=SIGN(O106-P106),Reglement!$S$4*$J106,0))*IF(AND($E106+$F106>=6,O106+P106>=6),Reglement!$S$29,IF(AND($E106+$F106>=4,O106+P106>=4),Reglement!$S$28,1)))","v":""}]
[null,null,{"$f":"Score!F138","v":"Arsenal"},{"$f":"Score!I138","v":"Wolverhampton"},{"$f":"IF(Score!G138<>\"\",Score!G138,\"\")","v":""},{"$f":"IF(Score!H138<>\"\",Score!H138,\"\")","v":""},1,1,1,"",{"$f":"IF($K$4<>0,HLOOKUP($K$4,$O$4:$XFD107,ROW()-3,FALSE),\"\")","v":""},{"$f":"IF($K$4<>0,HLOOKUP(CONCATENATE($K$4,\"1\"),$O$4:$XFD107,ROW()-3,FALSE),\"\")","v":""},{"$f":"IF($K$4<>0,HLOOKUP(CONCATENATE($K$4,\"2\"),$O$4:$XFD107,ROW()-3,FALSE),\"\")","v":""},{"$nulls":3},{"$f":"IF(OR($E107=\"\",$F107=\"\",O107=\"\",P107=\"\"),\"\",IF(AND(O107=$E107,P107=$F107),Reglement!$S$3*$J107,IF(SIGN($E107-$F107)=SIGN(O107-P107),Reglement!$S$4*$J107,0))*IF(AND($E107+$F107>=6,O107+P107>=6),Reglement!$S$29,IF(AND($E107+$F107>=4,O107+P107>=4),Reglement!$S$28,1)))","v":""}]
[null,null,{"$f":"Score!F139","v":"Aston Villa"},{"$f":"Score!I139","v":"Liverpool"},{"$f":"IF(Score!G139<>\"\",Score!G139,\"\")","v":""},{"$f":"IF(Score!H139<>\"\",Score!H139,\"\")","v":""},1,1,1,"",{"$f":"IF($K$4<>0,HLOOKUP($K$4,$O$4:$XFD108,ROW()-3,FALSE),\"\")","v":""},{"$f":"IF($K$4<>0,HLOOKUP(CONCATENATE($K$4,\"1\"),$O$4:$XFD108,ROW()-3,FALSE),\"\")","v":""},{"$f":"IF($K$4<>0,HLOOKUP(CONCATENATE($K$4,\"2\"),$O$4:$XFD108,ROW()-3,FALSE),\"\")","v":""},{"$nulls":3},{"$f":"IF(OR($E108=\"\",$F108=\"\",O108=\"\",P108=\"\"),\"\",IF(AND(O108=$E108,P108=$F108),Reglement!$S$3*$J108,IF(SIGN($E108-$F108)=SIGN(O108-P108),Reglement!$S$4*$J108,0))*IF(AND($E108+$F108>=6,O108+P108>=6),Reglement!$S$29,IF(AND($E108+$F108>=4,O108+P108>=4),Reglement!$S$28,1)))","v":""}]
[null,null,{"$f":"Score!F140","v":"Brighton"},{"$f":"Score!I140","v":"Norwich"},{"$f":"IF(Score!G140<>\"\",Score!G140,\"\")","v":""},{"$f":"IF(Score!H140<>\"\",Score!H140,\"\")","v":""},1,1,1,"",{"$f":"IF($K$4<>0,HLOOKUP($K$4,$O$4:$XFD109,ROW()-3,FALSE),\"\")","v":""},{"$f":"IF($K$4<>0,HLOOKUP(CONCATENATE($K$4,\"1\"),$O$4:$XFD109,ROW()-3,FALSE),\"\")","v":""},{"$f":"IF($K$4<>0,HLOOKUP(CONCATENATE($K$4,\"2\"),$O$4:$XFD109,ROW()-3,FALSE),\"\")","v":""},{"$nulls":3},{"$f":"IF(OR($E109=\"\",$F109=\"\",O109=\"\",P109=\"\"),\"\",IF(AND(O109=$E109,P109=$F109),Reglement!$S$3*$J109,IF(SIGN($E109-$F109)=SIGN(O109-P109),Reglement!$S$4*$J109,0))*IF(AND($E109+$F109>=6,O109+P109>=6),Reglement!$S$29,IF(AND($E109+$F109>=4,O109+P109>=4),Reglement!$S$28,1)))","v":""}]
[null,null,{"$f":"Score!F141","v":"Crystal Palace"},{"$f":"Score!I141","v":"Leicester City"},{"$f":"IF(Score!G141<>\"\",Score!G141,\"\")","v":""},{"$f":"IF(Score!H141<>\"\",Score!H141,\"\")","v":""},1,1,1,"",{"$f":"IF($K$4<>0,HLOOKUP($K$4,$O$4:$XFD110,ROW()-3,FALSE),\"\")","v":""},{"$f":"IF($K$4<>0,HLOOKUP(CONCATENATE($K$4,\"1\"),$O$4:$XFD110,ROW()-3,FALSE),\"\")","v":""},{"$f":"IF($K$4<>0,HLOOKUP(CONCATENATE($K$4,\"2\"),$O$4:$XFD110,ROW()-3,FALSE),\"\")","v":""},{"$nulls":3},{"$f":"IF(OR($E110=\"\",$F110=\"\",O110=\"\",P110=\"\"),\"\",IF(AND(O110=$E110,P110=$F110),Reglement!$S$3*$J110,IF(SIGN($E110-$F110)=SIGN(O110-P110),Reglement!$S$4*$J110,0))*IF(AND($E110+$F110>=6,O110+P110>=6),Reglement!$S$29,IF(AND($E110+$F110>=4,O110+P110>=4),Reglement!$S$28,1)))","v":""}]
[null,null,{"$f":"Score!F142","v":"Everton"},{"$f":"Score!I142","v":"Tottenham"},{"$f":"IF(Score!G142<>\"\",Score!G142,\"\")","v":""},{"$f":"IF(Score!H142<>\"\",Score!H142,\"\")","v":""},1,1,1,"",{"$f":"IF($K$4<>0,HLOOKUP($K$4,$O$4:$XFD111,ROW()-3,FALSE),\"\")","v":""},{"$f":"IF($K$4<>0,HLOOKUP(CONCATENATE($K$4,\"1\"),$O$4:$XFD111,ROW()-3,FALSE),\"\")","v":""},{"$f":"IF($K$4<>0,HLOOKUP(CONCATENATE($K$4,\"2\"),$O$4:$XFD111,ROW()-3,FALSE),\"\")","v":""},{"$nulls":3},{"$f":"IF(OR($E111=\"\",$F111=\"\",O111=\"\",P111=\"\"),\"\",IF(AND(O111=$E111,P111=$F111),Reglement!$S$3*$J111,IF(SIGN($E111-$F111)=SIGN(O111-P111),Reglement!$S$4*$J111,0))*IF(AND($E111+$F111>=6,O111+P111>=6),Reglement!$S$29,IF(AND($E111+$F111>=4,O111+P111>=4),Reglement!$S$28,1)))","v":""}]
[null,null,{"$f":"Score!F143","v":"Manchester City"},{"$f":"Score!I143","v":"Southampton"},{"$f":"IF(Score!G143<>\"\",Score!G143,\"\")","v":""},{"$f":"IF(Score!H143<>\"\",Score!H143,\"\")","v":""},1,1,1,"",{"$f":"IF($K$4<>0,HLOOKUP($K$4,$O$4:$XFD112,ROW()-3,FALSE),\"\")","v":""},{"$f":"IF($K$4<>0,HLOOKUP(CONCATENATE($K$4,\"1\"),$O$4:$XFD112,ROW()-3,FALSE),\"\")","v":""},{"$f":"IF($K$4<>0,HLOOKUP(CONCATENATE($K$4,\"2\"),$O$4:$XFD112,ROW()-3,FALSE),\"\")","v":""},{"$nulls":3},{"$f":"IF(OR($E112=\"\",$F112=\"\",O112=\"\",P112=\"\"),\"\",IF(AND(O112=$E112,P112=$F112),Reglement!$S$3*$J112,IF(SIGN($E112-$F112)=SIGN(O112-P112),Reglement!$S$4*$J112,0))*IF(AND($E112+$F112>=6,O112+P112>=6),Reglement!$S$29,IF(AND($E112+$F112>=4,O112+P112>=4),Reglement!$S$28,1)))","v":""}]
[null,null,{"$f":"Score!F144","v":"Sheffield United"},{"$f":"Score!I144","v":"Burnley"},{"$f":"IF(Score!G144<>\"\",Score!G144,\"\")","v":""},{"$f":"IF(Score!H144<>\"\",Score!H144,\"\")","v":""},1,1,1,"",{"$f":"IF($K$4<>0,HLOOKUP($K$4,$O$4:$XFD113,ROW()-3,FALSE),\"\")","v":""},{"$f":"IF($K$4<>0,HLOOKUP(CONCATENATE($K$4,\"1\"),$O$4:$XFD113,ROW()-3,FALSE),\"\")","v":""},{"$f":"IF($K$4<>0,HLOOKUP(CONCATENATE($K$4,\"2\"),$O$4:$XFD113,ROW()-3,FALSE),\"\")","v":""},{"$nulls":3},{"$f":"IF(OR($E113=\"\",$F113=\"\",O113=\"\",P113=\"\"),\"\",IF(AND(O113=$E113,P113=$F113),Reglement!$S$3*$J113,IF(SIGN($E113-$F113)=SIGN(O113-P113),Reglement!$S$4*$J113,0))*IF(AND($E113+$F113>=6,O113+P113>=6),Reglement!$S$29,IF(AND($E113+$F113>=4,O113+P113>=4),Reglement!$S$28,1)))","v":""}]
[null,null,{"$f":"Score!F145","v":"Watford"},{"$f":"Score!I145","v":"Chelsea"},{"$f":"IF(Score!G145<>\"\",Score!G145,\"\")","v":""},{"$f":"IF(Score!H145<>\"\",Score!H145,\"\")","v":""},1,1,1,"",{"$f":"IF($K$4<>0,HLOOKUP($K$4,$O$4:$XFD114,ROW()-3,FALSE),\"\")","v":""},{"$f":"IF($K$4<>0,HLOOKUP(CONCATENATE($K$4,\"1\"),$O$4:$XFD114,ROW()-3,FALSE),\"\")","v":""},{"$f":"IF($K$4<>0,HLOOKUP(CONCATENATE($K$4,\"2\"),$O$4:$XFD114,ROW()-3,FALSE),\"\")","v":""},{"$nulls":3},{"$f":"IF(OR($E114=\"\",$F114=\"\",O114=\"\",P114=\"\"),\"\",IF(AND(O114=$E114,P114=$F114),Reglement!$S$3*$J114,IF(SIGN($E114-$F114)=SIGN(O114-P114),Reglement!$S$4*$J114,0))*IF(AND($E114+$F114>=6,O114+P114>=6),Reglement!$S$29,IF(AND($E114+$F114>=4,O114+P114>=4),Reglement!$S$28,1)))","v":""}]
[null,null,{"$f":"Score!F146","v":"West Ham"},{"$f":"Score!I146","v":"Newcastle"},{"$f":"IF(Score!G146<>\"\",Score!G146,\"\")","v":""},{"$f":"IF(Score!H146<>\"\",Score!H146,\"\")","v":""},1,1,1,"",{"$f":"IF($K$4<>0,HLOOKUP($K$4,$O$4:$XFD115,ROW()-3,FALSE),\"\")","v":""},{"$f":"IF($K$4<>0,HLOOKUP(CONCATENATE($K$4,\"1\"),$O$4:$XFD115,ROW()-3,FALSE),\"\")","v":""},{"$f":"IF($K$4<>0,HLOOKUP(CONCATENATE($K$4,\"2\"),$O$4:$XFD115,ROW()-3,FALSE),\"\")","v":""},{"$nulls":3},{"$f":"IF(OR($E115=\"\",$F115=\"\",O115=\"\",P115=\"\"),\"\",IF(AND(O115=$E115,P115=$F115),Reglement!$S$3*$J115,IF(SIGN($E115-$F115)=SIGN(O115-P115),Reglement!$S$4*$J115,0))*IF(AND($E115+$F115>=6,O115+P115>=6),Reglement!$S$29,IF(AND($E115+$F115>=4,O115+P115>=4),Reglement!$S$28,1)))","v":""}]
["JOURNEE n°12",null,{"$f":"Score!F150","v":"Burnley"},{"$f":"Score!I150","v":"West Ham"},{"$f":"IF(Score!G150<>\"\",Score!G150,\"\")","v":""},{"$f":"IF(Score!H150<>\"\",Score!H150,\"\")","v":""},1,1,1,"",{"$f":"IF($K$4<>0,HLOOKUP($K$4,$O$4:$XFD116,ROW()-3,FALSE),\"\")","v":""},{"$f":"IF($K$4<>0,HLOOKUP(CONCATENATE($K$4,\"1\"),$O$4:$XFD116,ROW()-3,FALSE),\"\")","v":""},{"$f":"IF($K$4<>0,HLOOKUP(CONCATENATE($K$4,\"2\"),$O$4:$XFD116,ROW()-3,FALSE),\"\")","v":""},{"$nulls":3},{"$f":"IF(OR($E116=\"\",$F116=\"\",O116=\"\",P116=\"\"),\"\",IF(AND(O116=$E116,P116=$F116),Reglement!$S$3*$J116,IF(SIGN($E116-$F116)=SIGN(O116-P116),Reglement!$S$4*$J116,0))*IF(AND($E116+$F116>=6,O116+P116>=6),Reglement!$S$29,IF(AND($E116+$F116>=4,O116+P116>=4),Reglement!$S$28,1)))","v":""}]
[null,null,{"$f":"Score!F151","v":"Chelsea"},{"$f":"Score!I151","v":"Crystal Palace"},{"$f":"IF(Score!G151<>\"\",Score!G151,\"\")","v":""},{"$f":"IF(Score!H151<>\"\",Score!H151,\"\")","v":""},1,1,1,"",{"$f":"IF($K$4<>0,HLOOKUP($K$4,$O$4:$XFD117,ROW()-3,FALSE),\"\")","v":""},{"$f":"IF($K$4<>0,HLOOKUP(CONCATENATE($K$4,\"1\"),$O$4:$XFD117,ROW()-3,FALSE),\"\")","v":""},{"$f":"IF($K$4<>0,HLOOKUP(CONCATENATE($K$4,\"2\"),$O$4:$XFD117,ROW()-3,FALSE),\"\")","v":""},{"$nulls":3},{"$f":"IF(OR($E117=\"\",$F117=\"\",O117=\"\",P117=\"\"),\"\",IF(AND(O117=$E117,P117=$F117),Reglement!$S$3*$J117,IF(SIGN($E117-$F117)=SIGN(O117-P117),Reglement!$S$4*$J117,0))*IF(AND($E117+$F117>=6,O117+P117>=6),Reglement!$S$29,IF(AND($E117+$F117>=4,O117+P117>=4),Reglement!$S$28,1)))","v":""}]
[null,null,{"$f":"Score!F152","v":"Leicester City"},{"$f":"Score!I152","v":"Arsenal"},{"$f":"IF(Score!G152<>\"\",Score!G152,\"\")","v":""},{"$f":"IF(Score!H152<>\"\",Score!H152,\"\")","v":""},1,1,1,"",{"$f":"IF($K$4<>0,HLOOKUP($K$4,$O$4:$XFD118,ROW()-3,FALSE),\"\")","v":""},{"$f":"IF($K$4<>0,HLOOKUP(CONCATENATE($K$4,\"1\"),$O$4:$XFD118,ROW()-3,FALSE),\"\")","v":""},{"$f":"IF($K$4<>0,HLOOKUP(CONCATENATE($K$4,\"2\"),$O$4:$XFD118,ROW()-3,FALSE),\"\")","v":""},{"$nulls":3},{"$f":"IF(OR($E118=\"\",$F118=\"\",O118=\"\",P118=\"\"),\"\",IF(AND(O118=$E118,P118=$F118),Reglement!$S$3*$J118,IF(SIGN($E118-$F118)=SIGN(O118-P118),Reglement!$S$4*$J118,0))*IF(AND($E118+$F118>=6,O118+P118>=6),Reglement!$S$29,IF(AND($E118+$F118>=4,O118+P118>=4),Reglement!$S$28,1)))","v":""}]
[null,null,{"$f":"Score!F153","v":"Liverpool"},{"$f":"Score!I153","v":"Manchester City"},{"$f":"IF(Score!G153<>\"\",Score!G153,\"\")","v":""},{"$f":"IF(Score!H153<>\"\",Score!H153,\"\")","v":""},1,1,1,"",{"$f":"IF($K$4<>0,HLOOKUP($K$4,$O$4:$XFD119,ROW()-3,FALSE),\"\")","v":""},{"$f":"IF($K$4<>0,HLOOKUP(CONCATENATE($K$4,\"1\"),$O$4:$XFD119,ROW()-3,FALSE),\"\")","v":""},{"$f":"IF($K$4<>0,HLOOKUP(CONCATENATE($K$4,\"2\"),$O$4:$XFD119,ROW()-3,FALSE),\"\")","v":""},{"$nulls":3},{"$f":"IF(OR($E119=\"\",$F119=\"\",O119=\"\",P119=\"\"),\"\",IF(AND(O119=$E119,P119=$F119),Reglement!$S$3*$J119,IF(SIGN($E119-$F119)=SIGN(O119-P119),Reglement!$S$4*$J119,0))*IF(AND($E119+$F119>=6,O119+P119>=6),Reglement!$S$29,IF(AND($E119+$F119>=4,O119+P119>=4),Reglement!$S$28,1)))","v":""}]
[null,null,{"$f":"Score!F154","v":"Manchester United"},{"$f":"Score!I154","v":"Brighton"},{"$f":"IF(Score!G154<>\"\",Score!G154,\"\")","v":""},{"$f":"IF(Score!H154<>\"\",Score!H154,\"\")","v":""},1,1,1,"",{"$f":"IF($K$4<>0,HLOOKUP($K$4,$O$4:$XFD120,ROW()-3,FALSE),\"\")","v":""},{"$f":"IF($K$4<>0,HLOOKUP(CONCATENATE($K$4,\"1\"),$O$4:$XFD120,ROW()-3,FALSE),\"\")","v":""},{"$f":"IF($K$4<>0,HLOOKUP(CONCATENATE($K$4,\"2\"),$O$4:$XFD120,ROW()-3,FALSE),\"\")","v":""},{"$nulls":3},{"$f":"IF(OR($E120=\"\",$F120=\"\",O120=\"\",P120=\"\"),\"\",IF(AND(O120=$E120,P120=$F120),Reglement!$S$3*$J120,IF(SIGN($E120-$F120)=SIGN(O120-P120),Reglement!$S$4*$J120,0))*IF(AND($E120+$F120>=6,O120+P120>=6),Reglement!$S$29,IF(AND($E120+$F120>=4,O120+P120>=4),Reglement!$S$28,1)))","v":""}]
[null,null,{"$f":"Score!F155","v":"Newcastle"},{"$f":"Score!I155","v":"Bournemouth"},{"$f":"IF(Score!G155<>\"\",Score!G155,\"\")","v":""},{"$f":"IF(Score!H155<>\"\",Score!H155,\"\")","v":""},1,1,1,"",{"$f":"IF($K$4<>0,HLOOKUP($K$4,$O$4:$XFD121,ROW()-3,FALSE),\"\")","v":""},{"$f":"IF($K$4<>0,HLOOKUP(CONCATENATE($K$4,\"1\"),$O$4:$XFD121,ROW()-3,FALSE),\"\")","v":""},{"$f":"IF($K$4<>0,HLOOKUP(CONCATENATE($K$4,\"2\"),$O$4:$XFD121,ROW()-3,FALSE),\"\")","v":""},{"$nulls":3},{"$f":"IF(OR($E121=\"\",$F121=\"\",O121=\"\",P121=\"\"),\"\",IF(AND(O121=$E121,P121=$F121),Reglement!$S$3*$J121,IF(SIGN($E121-$F121)=SIGN(O121-P121),Reglement!$S$4*$J121,0))*IF(AND($E121+$F121>=6,O121+P121>=6),Reglement!$S$29,IF(AND($E121+$F121>=4,O121+P121>=4),Reglement!$S$28,1)))","v":""}]
[null,null,{"$f":"Score!F156","v":"Norwich"},{"$f":"Score!I156","v":"Watford"},{"$f":"IF(Score!G156<>\"\",Score!G156,\"\")","v":""},{"$f":"IF(Score!H156<>\"\",Score!H156,\"\")","v":""},1,1,1,"",{"$f":"IF($K$4<>0,HLOOKUP($K$4,$O$4:$XFD122,ROW()-3,FALSE),\"\")","v":""},{"$f":"IF($K$4<>0,HLOOKUP(CONCATENATE($K$4,\"1\"),$O$4:$XFD122,ROW()-3,FALSE),\"\")","v":""},{"$f":"IF($K$4<>0,HLOOKUP(CONCATENATE($K$4,\"2\"),$O$4:$XFD122,ROW()-3,FALSE),\"\")","v":""},{"$nulls":3},{"$f":"IF(OR($E122=\"\",$F122=\"\",O122=\"\",P122=\"\"),\"\",IF(AND(O122=$E122,P122=$F122),Reglement!$S$3*$J122,IF(SIGN($E122-$F122)=SIGN(O122-P122),Reglement!$S$4*$J122,0))*IF(AND($E122+$F122>=6,O122+P122>=6),Reglement!$S$29,IF(AND($E122+$F122>=4,O122+P122>=4),Reglement!$S$28,1)))","v":""}]
[null,null,{"$f":"Score!F157","v":"Southampton"},{"$f":"Score!I157","v":"Everton"},{"$f":"IF(Score!G157<>\"\",Score!G157,\"\")","v":""},{"$f":"IF(Score!H157<>\"\",Score!H157,\"\")","v":""},1,1,1,"",{"$f":"IF($K$4<>0,HLOOKUP($K$4,$O$4:$XFD123,ROW()-3,FALSE),\"\")","v":""},{"$f":"IF($K$4<>0,HLOOKUP(CONCATENATE($K$4,\"1\"),$O$4:$XFD123,ROW()-3,FALSE),\"\")","v":""},{"$f":"IF($K$4<>0,HLOOKUP(CONCATENATE($K$4,\"2\"),$O$4:$XFD123,ROW()-3,FALSE),\"\")","v":""},{"$nulls":3},{"$f":"IF(OR($E123=\"\",$F123=\"\",O123=\"\",P123=\"\"),\"\",IF(AND(O123=$E123,P123=$F123),Reglement!$S$3*$J123,IF(SIGN($E123-$F123)=SIGN(O123-P123),Reglement!$S$4*$J123,0))*IF(AND($E123+$F123>=6,O123+P123>=6),Reglement!$S$29,IF(AND($E123+$F123>=4,O123+P123>=4),Reglement!$S$28,1)))","v":""}]
[null,null,{"$f":"Score!F158","v":"Tottenham"},{"$f":"Score!I158","v":"Sheffield United"},{"$f":"IF(Score!G158<>\"\",Score!G158,\"\")","v":""},{"$f":"IF(Score!H158<>\"\",Score!H158,\"\")","v":""},1,1,1,"",{"$f":"IF($K$4<>0,HLOOKUP($K$4,$O$4:$XFD124,ROW()-3,FALSE),\"\")","v":""},{"$f":"IF($K$4<>0,HLOOKUP(CONCATENATE($K$4,\"1\"),$O$4:$XFD124,ROW()-3,FALSE),\"\")","v":""},{"$f":"IF($K$4<>0,HLOOKUP(CONCATENATE($K$4,\"2\"),$O$4:$XFD124,ROW()-3,FALSE),\"\")","v":""},{"$nulls":3},{"$f":"IF(OR($E124=\"\",$F124=\"\",O124=\"\",P124=\"\"),\"\",IF(AND(O124=$E124,P124=$F124),Reglement!$S$3*$J124,IF(SIGN($E124-$F124)=SIGN(O124-P124),Reglement!$S$4*$J124,0))*IF(AND($E124+$F124>=6,O124+P124>=6),Reglement!$S$29,IF(AND($E124+$F124>=4,O124+P124>=4),Reglement!$S$28,1)))","v":""}]
[null,null,{"$f":"Score!F159","v":"Wolverhampton"},{"$f":"Score!I159","v":"Aston Villa"},{"$f":"IF(Score!G159<>\"\",Score!G159,\"\")","v":""},{"$f":"IF(Score!H159<>\"\",Score!H159,\"\")","v":""},1,1,1,"",{"$f":"IF($K$4<>0,HLOOKUP($K$4,$O$4:$XFD125,ROW()-3,FALSE),\"\")","v":""},{"$f":"IF($K$4<>0,HLOOKUP(CONCATENATE($K$4,\"1\"),$O$4:$XFD125,ROW()-3,FALSE),\"\")","v":""},{"$f":"IF($K$4<>0,HLOOKUP(CONCATENATE($K$4,\"2\"),$O$4:$XFD125,ROW()-3,FALSE),\"\")","v":""},{"$nulls":3},{"$f":"IF(OR($E125=\"\",$F125=\"\",O125=\"\",P125=\"\"),\"\",IF(AND(O125=$E125,P125=$F125),Reglement!$S$3*$J125,IF(SIGN($E125-$F125)=SIGN(O125-P125),Reglement!$S$4*$J125,0))*IF(AND($E125+$F125>=6,O125+P125>=6),Reglement!$S$29,IF(AND($E125+$F125>=4,O125+P125>=4),Reglement!$S$28,1)))","v":""}]
["JOURNEE n°13",null,{"$f":"Score!F163","v":"Bournemouth"},{"$f":"Score!I163","v":"Wolverhampton"},{"$f":"IF(Score!G163<>\"\",Score!G163,\"\")","v":""},{"$f":"IF(Score!H163<>\"\",Score!H163,\"\")","v":""},1,1,1,"",{"$f":"IF($K$4<>0,HLOOKUP($K$4,$O$4:$XFD126,ROW()-3,FALSE),\"\")","v":""},{"$f":"IF($K$4<>0,HLOOKUP(CONCATENATE($K$4,\"1\"),$O$4:$XFD126,ROW()-3,FALSE),\"\")","v":""},{"$f":"IF($K$4<>0,HLOOKUP(CONCATENATE($K$4,\"2\"),$O$4:$XFD126,ROW()-3,FALSE),\"\")","v":""},{"$nulls":3},{"$f":"IF(OR($E126=\"\",$F126=\"\",O126=\"\",P126=\"\"),\"\",IF(AND(O126=$E126,P126=$F126),Reglement!$S$3*$J126,IF(SIGN($E126-$F126)=SIGN(O126-P126),Reglement!$S$4*$J126,0))*IF(AND($E126+$F126>=6,O126+P126>=6),Reglement!$S$29,IF(AND($E126+$F126>=4,O126+P126>=4),Reglement!$S$28,1)))","v":""}]
[null,null,{"$f":"Score!F164","v":"Arsenal"},{"$f":"Score!I164","v":"Southampton"},{"$f":"IF(Score!G164<>\"\",Score!G164,\"\")","v":""},{"$f":"IF(Score!H164<>\"\",Score!H164,\"\")","v":""},1,1,1,{"$f":"IF(OR(E127=\"\",F127=\"\"),\"\",IF(E127>F127,G127,IF(E127=F127,H127,I127)))","v":""},{"$f":"IF($K$4<>0,HLOOKUP($K$4,$O$4:$XFD127,ROW()-3,FALSE),\"\")","v":""},{"$f":"IF($K$4<>0,HLOOKUP(CONCATENATE($K$4,\"1\"),$O$4:$XFD127,ROW()-3,FALSE),\"\")","v":""},{"$f":"IF($K$4<>0,HLOOKUP(CONCATENATE($K$4,\"2\"),$O$4:$XFD127,ROW()-3,FALSE),\"\")","v":""},{"$nulls":3},{"$f":"IF(OR($E127=\"\",$F127=\"\",O127=\"\",P127=\"\"),\"\",IF(AND(O127=$E127,P127=$F127),Reglement!$S$3*$J127,IF(SIGN($E127-$F127)=SIGN(O127-P127),Reglement!$S$4*$J127,0))*IF(AND($E127+$F127>=6,O127+P127>=6),Reglement!$S$29,IF(AND($E127+$F127>=4,O127+P127>=4),Reglement!$S$28,1)))","v":""}]
[null,null,{"$f":"Score!F165","v":"Aston Villa"},{"$f":"Score!I165","v":"Newcastle"},{"$f":"IF(Score!G165<>\"\",Score!G165,\"\")","v":""},{"$f":"IF(Score!H165<>\"\",Score!H165,\"\")","v":""},1,1,1,"",{"$f":"IF($K$4<>0,HLOOKUP($K$4,$O$4:$XFD128,ROW()-3,FALSE),\"\")","v":""},{"$f":"IF($K$4<>0,HLOOKUP(CONCATENATE($K$4,\"1\"),$O$4:$XFD128,ROW()-3,FALSE),\"\")","v":""},{"$f":"IF($K$4<>0,HLOOKUP(CONCATENATE($K$4,\"2\"),$O$4:$XFD128,ROW()-3,FALSE),\"\")","v":""},{"$nulls":3},{"$f":"IF(OR($E128=\"\",$F128=\"\",O128=\"\",P128=\"\"),\"\",IF(AND(O128=$E128,P128=$F128),Reglement!$S$3*$J128,IF(SIGN($E128-$F128)=SIGN(O128-P128),Reglement!$S$4*$J128,0))*IF(AND($E128+$F128>=6,O128+P128>=6),Reglement!$S$29,IF(AND($E128+$F128>=4,O128+P128>=4),Reglement!$S$28,1)))","v":""}]
[null,null,{"$f":"Score!F166","v":"Brighton"},{"$f":"Score!I166","v":"Leicester City"},{"$f":"IF(Score!G166<>\"\",Score!G166,\"\")","v":""},{"$f":"IF(Score!H166<>\"\",Score!H166,\"\")","v":""},1,1,1,"",{"$f":"IF($K$4<>0,HLOOKUP($K$4,$O$4:$XFD129,ROW()-3,FALSE),\"\")","v":""},{"$f":"IF($K$4<>0,HLOOKUP(CONCATENATE($K$4,\"1\"),$O$4:$XFD129,ROW()-3,FALSE),\"\")","v":""},{"$f":"IF($K$4<>0,HLOOKUP(CONCATENATE($K$4,\"2\"),$O$4:$XFD129,ROW()-3,FALSE),\"\")","v":""},{"$nulls":3},{"$f":"IF(OR($E129=\"\",$F129=\"\",O129=\"\",P129=\"\"),\"\",IF(AND(O129=$E129,P129=$F129),Reglement!$S$3*$J129,IF(SIGN($E129-$F129)=SIGN(O129-P129),Reglement!$S$4*$J129,0))*IF(AND($E129+$F129>=6,O129+P129>=6),Reglement!$S$29,IF(AND($E129+$F129>=4,O129+P129>=4),Reglement!$S$28,1)))","v":""}]
[null,null,{"$f":"Score!F167","v":"Crystal Palace"},{"$f":"Score!I167","v":"Liverpool"},{"$f":"IF(Score!G167<>\"\",Score!G167,\"\")","v":""},{"$f":"IF(Score!H167<>\"\",Score!H167,\"\")","v":""},1,1,1,"",{"$f":"IF($K$4<>0,HLOOKUP($K$4,$O$4:$XFD130,ROW()-3,FALSE),\"\")","v":""},{"$f":"IF($K$4<>0,HLOOKUP(CONCATENATE($K$4,\"1\"),$O$4:$XFD130,ROW()-3,FALSE),\"\")","v":""},{"$f":"IF($K$4<>0,HLOOKUP(CONCATENATE($K$4,\"2\"),$O$4:$XFD130,ROW()-3,FALSE),\"\")","v":""},{"$nulls":3},{"$f":"IF(OR($E130=\"\",$F130=\"\",O130=\"\",P130=\"\"),\"\",IF(AND(O130=$E130,P130=$F130),Reglement!$S$3*$J130,IF(SIGN($E130-$F130)=SIGN(O130-P130),Reglement!$S$4*$J130,0))*IF(AND($E130+$F130>=6,O130+P130>=6),Reglement!$S$29,IF(AND($E130+$F130>=4,O130+P130>=4),Reglement!$S$28,1)))","v":""}]
[null,null,{"$f":"Score!F168","v":"Everton"},{"$f":"Score!I168","v":"Norwich"},{"$f":"IF(Score!G168<>\"\",Score!G168,\"\")","v":""},{"$f":"IF(Score!H168<>\"\",Score!H168,\"\")","v":""},1,1,1,"",{"$f":"IF($K$4<>0,HLOOKUP($K$4,$O$4:$XFD131,ROW()-3,FALSE),\"\")","v":""},{"$f":"IF($K$4<>0,HLOOKUP(CONCATENATE($K$4,\"1\"),$O$4:$XFD131,ROW()-3,FALSE),\"\")","v":""},{"$f":"IF($K$4<>0,HLOOKUP(CONCATENATE($K$4,\"2\"),$O$4:$XFD131,ROW()-3,FALSE),\"\")","v":""},{"$nulls":3},{"$f":"IF(OR($E131=\"\",$F131=\"\",O131=\"\",P131=\"\"),\"\",IF(AND(O131=$E131,P131=$F131),Reglement!$S$3*$J131,IF(SIGN($E131-$F131)=SIGN(O131-P131),Reglement!$S$4*$J131,0))*IF(AND($E131+$F131>=6,O131+P131>=6),Reglement!$S$29,IF(AND($E131+$F131>=4,O131+P131>=4),Reglement!$S$28,1)))","v":""}]
[null,null,{"$f":"Score!F169","v":"Manchester City"},{"$f":"Score!I169","v":"Chelsea"},{"$f":"IF(Score!G169<>\"\",Score!G169,\"\")","v":""},{"$f":"IF(Score!H169<>\"\",Score!H169,\"\")","v":""},1,1,1,"",{"$f":"IF($K$4<>0,HLOOKUP($K$4,$O$4:$XFD132,ROW()-3,FALSE),\"\")","v":""},{"$f":"IF($K$4<>0,HLOOKUP(CONCATENATE($K$4,\"1\"),$O$4:$XFD132,ROW()-3,FALSE),\"\")","v":""},{"$f":"IF($K$4<>0,HLOOKUP(CONCATENATE($K$4,\"2\"),$O$4:$XFD132,ROW()-3,FALSE),\"\")","v":""},{"$nulls":3},{"$f":"IF(OR($E132=\"\",$F132=\"\",O132=\"\",P132=\"\"),\"\",IF(AND(O132=$E132,P132=$F132),Reglement!$S$3*$J132,IF(SIGN($E132-$F132)=SIGN(O132-P132),Reglement!$S$4*$J132,0))*IF(AND($E132+$F132>=6,O132+P132>=6),Reglement!$S$29,IF(AND($E132+$F132>=4,O132+P132>=4),Reglement!$S$28,1)))","v":""}]
[null,null,{"$f":"Score!F170","v":"Sheffield United"},{"$f":"Score!I170","v":"Manchester United"},{"$f":"IF(Score!G170<>\"\",Score!G170,\"\")","v":""},{"$f":"IF(Score!H170<>\"\",Score!H170,\"\")","v":""},1,1,1,{"$f":"IF(OR(E133=\"\",F133=\"\"),\"\",IF(E133>F133,G133,IF(E133=F133,H133,I133)))","v":""},{"$f":"IF($K$4<>0,HLOOKUP($K$4,$O$4:$XFD133,ROW()-3,FALSE),\"\")","v":""},{"$f":"IF($K$4<>0,HLOOKUP(CONCATENATE($K$4,\"1\"),$O$4:$XFD133,ROW()-3,FALSE),\"\")","v":""},{"$f":"IF($K$4<>0,HLOOKUP(CONCATENATE($K$4,\"2\"),$O$4:$XFD133,ROW()-3,FALSE),\"\")","v":""},{"$nulls":3},{"$f":"IF(OR($E133=\"\",$F133=\"\",O133=\"\",P133=\"\"),\"\",IF(AND(O133=$E133,P133=$F133),Reglement!$S$3*$J133,IF(SIGN($E133-$F133)=SIGN(O133-P133),Reglement!$S$4*$J133,0))*IF(AND($E133+$F133>=6,O133+P133>=6),Reglement!$S$29,IF(AND($E133+$F133>=4,O133+P133>=4),Reglement!$S$28,1)))","v":""}]
[null,null,{"$f":"Score!F171","v":"Watford"},{"$f":"Score!I171","v":"Burnley"},{"$f":"IF(Score!G171<>\"\",Score!G171,\"\")","v":""},{"$f":"IF(Score!H171<>\"\",Score!H171,\"\")","v":""},1,1,1,"",{"$f":"IF($K$4<>0,HLOOKUP($K$4,$O$4:$XFD134,ROW()-3,FALSE),\"\")","v":""},{"$f":"IF($K$4<>0,HLOOKUP(CONCATENATE($K$4,\"1\"),$O$4:$XFD134,ROW()-3,FALSE),\"\")","v":""},{"$f":"IF($K$4<>0,HLOOKUP(CONCATENATE($K$4,\"2\"),$O$4:$XFD134,ROW()-3,FALSE),\"\")","v":""},{"$nulls":3},{"$f":"IF(OR($E134=\"\",$F134=\"\",O134=\"\",P134=\"\"),\"\",IF(AND(O134=$E134,P134=$F134),Reglement!$S$3*$J134,IF(SIGN($E134-$F134)=SIGN(O134-P134),Reglement!$S$4*$J134,0))*IF(AND($E134+$F134>=6,O134+P134>=6),Reglement!$S$29,IF(AND($E134+$F134>=4,O134+P134>=4),Reglement!$S$28,1)))","v":""}]
[null,null,{"$f":"Score!F172","v":"West Ham"},{"$f":"Score!I172","v":"Tottenham"},{"$f":"IF(Score!G172<>\"\",Score!G172,\"\")","v":""},{"$f":"IF(Score!H172<>\"\",Score!H172,\"\")","v":""},1,1,1,"",{"$f":"IF($K$4<>0,HLOOKUP($K$4,$O$4:$XFD135,ROW()-3,FALSE),\"\")","v":""},{"$f":"IF($K$4<>0,HLOOKUP(CONCATENATE($K$4,\"1\"),$O$4:$XFD135,ROW()-3,FALSE),\"\")","v":""},{"$f":"IF($K$4<>0,HLOOKUP(CONCATENATE($K$4,\"2\"),$O$4:$XFD135,ROW()-3,FALSE),\"\")","v":""},{"$nulls":3},{"$f":"IF(OR($E135=\"\",$F135=\"\",O135=\"\",P135=\"\"),\"\",IF(AND(O135=$E135,P135=$F135),Reglement!$S$3*$J135,IF(SIGN($E135-$F135)=SIGN(O135-P135),Reglement!$S$4*$J135,0))*IF(AND($E135+$F135>=6,O135+P135>=6),Reglement!$S$29,IF(AND($E135+$F135>=4,O135+P135>=4),Reglement!$S$28,1)))","v":""}]
["JOURNEE n°14",null,{"$f":"Score!F176","v":"Burnley"},{"$f":"Score!I176","v":"Crystal Palace"},{"$f":"IF(Score!G176<>\"\",Score!G176,\"\")","v":""},{"$f":"IF(Score!H176<>\"\",Score!H176,\"\")","v":""},1,1,1,"",{"$f":"IF($K$4<>0,HLOOKUP($K$4,$O$4:$XFD136,ROW()-3,FALSE),\"\")","v":""},{"$f":"IF($K$4<>0,HLOOKUP(CONCATENATE($K$4,\"1\"),$O$4:$XFD136,ROW()-3,FALSE),\"\")","v":""},{"$f":"IF($K$4<>0,HLOOKUP(CONCATENATE($K$4,\"2\"),$O$4:$XFD136,ROW()-3,FALSE),\"\")","v":""},{"$nulls":3},{"$f":"IF(OR($E136=\"\",$F136=\"\",O136=\"\",P136=\"\"),\"\",IF(AND(O136=$E136,P136=$F136),Reglement!$S$3*$J136,IF(SIGN($E136-$F136)=SIGN(O136-P136),Reglement!$S$4*$J136,0))*IF(AND($E136+$F136>=6,O136+P136>=6),Reglement!$S$29,IF(AND($E136+$F136>=4,O136+P136>=4),Reglement!$S$28,1)))","v":""}]
[null,null,{"$f":"Score!F177","v":"Chelsea"},{"$f":"Score!I177","v":"West Ham"},{"$f":"IF(Score!G177<>\"\",Score!G177,\"\")","v":""},{"$f":"IF(Score!H177<>\"\",Score!H177,\"\")","v":""},1,1,1,"",{"$f":"IF($K$4<>0,HLOOKUP($K$4,$O$4:$XFD137,ROW()-3,FALSE),\"\")","v":""},{"$f":"IF($K$4<>0,HLOOKUP(CONCATENATE($K$4,\"1\"),$O$4:$XFD137,ROW()-3,FALSE),\"\")","v":""},{"$f":"IF($K$4<>0,HLOOKUP(CONCATENATE($K$4,\"2\"),$O$4:$XFD137,ROW()-3,FALSE),\"\")","v":""},{"$nulls":3},{"$f":"IF(OR($E137=\"\",$F137=\"\",O137=\"\",P137=\"\"),\"\",IF(AND(O137=$E137,P137=$F137),Reglement!$S$3*$J137,IF(SIGN($E137-$F137)=SIGN(O137-P137),Reglement!$S$4*$J137,0))*IF(AND($E137+$F137>=6,O137+P137>=6),Reglement!$S$29,IF(AND($E137+$F137>=4,O137+P137>=4),Reglement!$S$28,1)))","v":""}]
[null,null,{"$f":"Score!F178","v":"Leicester City"},{"$f":"Score!I178","v":"Everton"},{"$f":"IF(Score!G178<>\"\",Score!G178,\"\")","v":""},{"$f":"IF(Score!H178<>\"\",Score!H178,\"\")","v":""},1,1,1,"",{"$f":"IF($K$4<>0,HLOOKUP($K$4,$O$4:$XFD138,ROW()-3,FALSE),\"\")","v":""},{"$f":"IF($K$4<>0,HLOOKUP(CONCATENATE($K$4,\"1\"),$O$4:$XFD138,ROW()-3,FALSE),\"\")","v":""},{"$f":"IF($K$4<>0,HLOOKUP(CONCATENATE($K$4,\"2\"),$O$4:$XFD138,ROW()-3,FALSE),\"\")","v":""},{"$nulls":3},{"$f":"IF(OR($E138=\"\",$F138=\"\",O138=\"\",P138=\"\"),\"\",IF(AND(O138=$E138,P138=$F138),Reglement!$S$3*$J138,IF(SIGN($E138-$F138)=SIGN(O138-P138),Reglement!$S$4*$J138,0))*IF(AND($E138+$F138>=6,O138+P138>=6),Reglement!$S$29,IF(AND($E138+$F138>=4,O138+P138>=4),Reglement!$S$28,1)))","v":""}]
[null,null,{"$f":"Score!F179","v":"Liverpool"},{"$f":"Score!I179","v":"Brighton"},{"$f":"IF(Score!G179<>\"\",Score!G179,\"\")","v":""},{"$f":"IF(Score!H179<>\"\",Score!H179,\"\")","v":""},1,1,1,"",{"$f":"IF($K$4<>0,HLOOKUP($K$4,$O$4:$XFD139,ROW()-3,FALSE),\"\")","v":""},{"$f":"IF($K$4<>0,HLOOKUP(CONCATENATE($K$4,\"1\"),$O$4:$XFD139,ROW()-3,FALSE),\"\")","v":""},{"$f":"IF($K$4<>0,HLOOKUP(CONCATENATE($K$4,\"2\"),$O$4:$XFD139,ROW()-3,FALSE),\"\")","v":""},{"$nulls":3},{"$f":"IF(OR($E139=\"\",$F139=\"\",O139=\"\",P139=\"\"),\"\",IF(AND(O139=$E139,P139=$F139),Reglement!$S$3*$J139,IF(SIGN($E139-$F139)=SIGN(O139-P139),Reglement!$S$4*$J139,0))*IF(AND($E139+$F139>=6,O139+P139>=6),Reglement!$S$29,IF(AND($E139+$F139>=4,O139+P139>=4),Reglement!$S$28,1)))","v":""}]
[null,null,{"$f":"Score!F180","v":"Manchester United"},{"$f":"Score!I180","v":"Aston Villa"},{"$f":"IF(Score!G180<>\"\",Score!G180,\"\")","v":""},{"$f":"IF(Score!H180<>\"\",Score!H180,\"\")","v":""},1,1,1,"",{"$f":"IF($K$4<>0,HLOOKUP($K$4,$O$4:$XFD140,ROW()-3,FALSE),\"\")","v":""},{"$f":"IF($K$4<>0,HLOOKUP(CONCATENATE($K$4,\"1\"),$O$4:$XFD140,ROW()-3,FALSE),\"\")","v":""},{"$f":"IF($K$4<>0,HLOOKUP(CONCATENATE($K$4,\"2\"),$O$4:$XFD140,ROW()-3,FALSE),\"\")","v":""},{"$nulls":3},{"$f":"IF(OR($E140=\"\",$F140=\"\",O140=\"\",P140=\"\"),\"\",IF(AND(O140=$E140,P140=$F140),Reglement!$S$3*$J140,IF(SIGN($E140-$F140)=SIGN(O140-P140),Reglement!$S$4*$J140,0))*IF(AND($E140+$F140>=6,O140+P140>=6),Reglement!$S$29,IF(AND($E140+$F140>=4,O140+P140>=4),Reglement!$S$28,1)))","v":""}]
[null,null,{"$f":"Score!F181","v":"Newcastle"},{"$f":"Score!I181","v":"Manchester City"},{"$f":"IF(Score!G181<>\"\",Score!G181,\"\")","v":""},{"$f":"IF(Score!H181<>\"\",Score!H181,\"\")","v":""},1,1,1,"",{"$f":"IF($K$4<>0,HLOOKUP($K$4,$O$4:$XFD141,ROW()-3,FALSE),\"\")","v":""},{"$f":"IF($K$4<>0,HLOOKUP(CONCATENATE($K$4,\"1\"),$O$4:$XFD141,ROW()-3,FALSE),\"\")","v":""},{"$f":"IF($K$4<>0,HLOOKUP(CONCATENATE($K$4,\"2\"),$O$4:$XFD141,ROW()-3,FALSE),\"\")","v":""},{"$nulls":3},{"$f":"IF(OR($E141=\"\",$F141=\"\",O141=\"\",P141=\"\"),\"\",IF(AND(O141=$E141,P141=$F141),Reglement!$S$3*$J141,IF(SIGN($E141-$F141)=SIGN(O141-P141),Reglement!$S$4*$J141,0))*IF(AND($E141+$F141>=6,O141+P141>=6),Reglement!$S$29,IF(AND($E141+$F141>=4,O141+P141>=4),Reglement!$S$28,1)))","v":""}]
[null,null,{"$f":"Score!F182","v":"Norwich"},{"$f":"Score!I182","v":"Arsenal"},{"$f":"IF(Score!G182<>\"\",Score!G182,\"\")","v":""},{"$f":"IF(Score!H182<>\"\",Score!H182,\"\")","v":""},1,1,1,"",{"$f":"IF($K$4<>0,HLOOKUP($K$4,$O$4:$XFD142,ROW()-3,FALSE),\"\")","v":""},{"$f":"IF($K$4<>0,HLOOKUP(CONCATENATE($K$4,\"1\"),$O$4:$XFD142,ROW()-3,FALSE),\"\")","v":""},{"$f":"IF($K$4<>0,HLOOKUP(CONCATENATE($K$4,\"2\"),$O$4:$XFD142,ROW()-3,FALSE),\"\")","v":""},{"$nulls":3},{"$f":"IF(OR($E142=\"\",$F142=\"\",O142=\"\",P142=\"\"),\"\",IF(AND(O142=$E142,P142=$F142),Reglement!$S$3*$J142,IF(SIGN($E142-$F142)=SIGN(O142-P142),Reglement!$S$4*$J142,0))*IF(AND($E142+$F142>=6,O142+P142>=6),Reglement!$S$29,IF(AND($E142+$F142>=4,O142+P142>=4),Reglement!$S$28,1)))","v":""}]
[null,null,{"$f":"Score!F183","v":"Southampton"},{"$f":"Score!I183","v":"Watford"},{"$f":"IF(Score!G183<>\"\",Score!G183,\"\")","v":""},{"$f":"IF(Score!H183<>\"\",Score!H183,\"\")","v":""},1,1,1,"",{"$f":"IF($K$4<>0,HLOOKUP($K$4,$O$4:$XFD143,ROW()-3,FALSE),\"\")","v":""},{"$f":"IF($K$4<>0,HLOOKUP(CONCATENATE($K$4,\"1\"),$O$4:$XFD143,ROW()-3,FALSE),\"\")","v":""},{"$f":"IF($K$4<>0,HLOOKUP(CONCATENATE($K$4,\"2\"),$O$4:$XFD143,ROW()-3,FALSE),\"\")","v":""},{"$nulls":3},{"$f":"IF(OR($E143=\"\",$F143=\"\",O143=\"\",P143=\"\"),\"\",IF(AND(O143=$E143,P143=$F143),Reglement!$S$3*$J143,IF(SIGN($E143-$F143)=SIGN(O143-P143),Reglement!$S$4*$J143,0))*IF(AND($E143+$F143>=6,O143+P143>=6),Reglement!$S$29,IF(AND($E143+$F143>=4,O143+P143>=4),Reglement!$S$28,1)))","v":""}]
[null,null,{"$f":"Score!F184","v":"Tottenham"},{"$f":"Score!I184","v":"Bournemouth"},{"$f":"IF(Score!G184<>\"\",Score!G184,\"\")","v":""},{"$f":"IF(Score!H184<>\"\",Score!H184,\"\")","v":""},1,1,1,"",{"$f":"IF($K$4<>0,HLOOKUP($K$4,$O$4:$XFD144,ROW()-3,FALSE),\"\")","v":""},{"$f":"IF($K$4<>0,HLOOKUP(CONCATENATE($K$4,\"1\"),$O$4:$XFD144,ROW()-3,FALSE),\"\")","v":""},{"$f":"IF($K$4<>0,HLOOKUP(CONCATENATE($K$4,\"2\"),$O$4:$XFD144,ROW()-3,FALSE),\"\")","v":""},{"$nulls":3},{"$f":"IF(OR($E144=\"\",$F144=\"\",O144=\"\",P144=\"\"),\"\",IF(AND(O144=$E144,P144=$F144),Reglement!$S$3*$J144,IF(SIGN($E144-$F144)=SIGN(O144-P144),Reglement!$S$4*$J144,0))*IF(AND($E144+$F144>=6,O144+P144>=6),Reglement!$S$29,IF(AND($E144+$F144>=4,O144+P144>=4),Reglement!$S$28,1)))","v":""}]
[null,null,{"$f":"Score!F185","v":"Wolverhampton"},{"$f":"Score!I185","v":"Sheffield United"},{"$f":"IF(Score!G185<>\"\",Score!G185,\"\")","v":""},{"$f":"IF(Score!H185<>\"\",Score!H185,\"\")","v":""},1,1,1,"",{"$f":"IF($K$4<>0,HLOOKUP($K$4,$O$4:$XFD145,ROW()-3,FALSE),\"\")","v":""},{"$f":"IF($K$4<>0,HLOOKUP(CONCATENATE($K$4,\"1\"),$O$4:$XFD145,ROW()-3,FALSE),\"\")","v":""},{"$f":"IF($K$4<>0,HLOOKUP(CONCATENATE($K$4,\"2\"),$O$4:$XFD145,ROW()-3,FALSE),\"\")","v":""},{"$nulls":3},{"$f":"IF(OR($E145=\"\",$F145=\"\",O145=\"\",P145=\"\"),\"\",IF(AND(O145=$E145,P145=$F145),Reglement!$S$3*$J145,IF(SIGN($E145-$F145)=SIGN(O145-P145),Reglement!$S$4*$J145,0))*IF(AND($E145+$F145>=6,O145+P145>=6),Reglement!$S$29,IF(AND($E145+$F145>=4,O145+P145>=4),Reglement!$S$28,1)))","v":""}]
["JOURNEE n°15",null,{"$f":"Score!F189","v":"Arsenal"},{"$f":"Score!I189","v":"Brighton"},{"$f":"IF(Score!G189<>\"\",Score!G189,\"\")","v":""},{"$f":"IF(Score!H189<>\"\",Score!H189,\"\")","v":""},1,1,1,"",{"$f":"IF($K$4<>0,HLOOKUP($K$4,$O$4:$XFD146,ROW()-3,FALSE),\"\")","v":""},{"$f":"IF($K$4<>0,HLOOKUP(CONCATENATE($K$4,\"1\"),$O$4:$XFD146,ROW()-3,FALSE),\"\")","v":""},{"$f":"IF($K$4<>0,HLOOKUP(CONCATENATE($K$4,\"2\"),$O$4:$XFD146,ROW()-3,FALSE),\"\")","v":""},{"$nulls":3},{"$f":"IF(OR($E146=\"\",$F146=\"\",O146=\"\",P146=\"\"),\"\",IF(AND(O146=$E146,P146=$F146),Reglement!$S$3*$J146,IF(SIGN($E146-$F146)=SIGN(O146-P146),Reglement!$S$4*$J146,0))*IF(AND($E146+$F146>=6,O146+P146>=6),Reglement!$S$29,IF(AND($E146+$F146>=4,O146+P146>=4),Reglement!$S$28,1)))","v":""}]
[null,null,{"$f":"Score!F190","v":"Burnley"},{"$f":"Score!I190","v":"Manchester City"},{"$f":"IF(Score!G190<>\"\",Score!G190,\"\")","v":""},{"$f":"IF(Score!H190<>\"\",Score!H190,\"\")","v":""},1,1,1,"",{"$f":"IF($K$4<>0,HLOOKUP($K$4,$O$4:$XFD147,ROW()-3,FALSE),\"\")","v":""},{"$f":"IF($K$4<>0,HLOOKUP(CONCATENATE($K$4,\"1\"),$O$4:$XFD147,ROW()-3,FALSE),\"\")","v":""},{"$f":"IF($K$4<>0,HLOOKUP(CONCATENATE($K$4,\"2\"),$O$4:$XFD147,ROW()-3,FALSE),\"\")","v":""},{"$nulls":3},{"$f":"IF(OR($E147=\"\",$F147=\"\",O147=\"\",P147=\"\"),\"\",IF(AND(O147=$E147,P147=$F147),Reglement!$S$3*$J147,IF(SIGN($E147-$F147)=SIGN(O147-P147),Reglement!$S$4*$J147,0))*IF(AND($E147+$F147>=6,O147+P147>=6),Reglement!$S$29,IF(AND($E147+$F147>=4,O147+P147>=4),Reglement!$S$28,1)))","v":""}]
[null,null,{"$f":"Score!F191","v":"Leicester City"},{"$f":"Score!I191","v":"Watford"},{"$f":"IF(Score!G191<>\"\",Score!G191,\"\")","v":""},{"$f":"IF(Score!H191<>\"\",Score!H191,\"\")","v":""},1,1,1,"",{"$f":"IF($K$4<>0,HLOOKUP($K$4,$O$4:$XFD148,ROW()-3,FALSE),\"\")","v":""},{"$f":"IF($K$4<>0,HLOOKUP(CONCATENATE($K$4,\"1\"),$O$4:$XFD148,ROW()-3,FALSE),\"\")","v":""},{"$f":"IF($K$4<>0,HLOOKUP(CONCATENATE($K$4,\"2\"),$O$4:$XFD148,ROW()-3,FALSE),\"\")","v":""},{"$nulls":3},{"$f":"IF(OR($E148=\"\",$F148=\"\",O148=\"\",P148=\"\"),\"\",IF(AND(O148=$E148,P148=$F148),Reglement!$S$3*$J148,IF(SIGN($E148-$F148)=SIGN(O148-P148),Reglement!$S$4*$J148,0))*IF(AND($E148+$F148>=6,O148+P148>=6),Reglement!$S$29,IF(AND($E148+$F148>=4,O148+P148>=4),Reglement!$S$28,1)))","v":""}]
[null,null,{"$f":"Score!F192","v":"Sheffield United"},{"$f":"Score!I192","v":"Newcastle"},{"$f":"IF(Score!G192<>\"\",Score!G192,\"\")","v":""},{"$f":"IF(Score!H192<>\"\",Score!H192,\"\")","v":""},1,1,1,"",{"$f":"IF($K$4<>0,HLOOKUP($K$4,$O$4:$XFD149,ROW()-3,FALSE),\"\")","v":""},{"$f":"IF($K$4<>0,HLOOKUP(CONCATENATE($K$4,\"1\"),$O$4:$XFD149,ROW()-3,FALSE),\"\")","v":""},{"$f":"IF($K$4<>0,HLOOKUP(CONCATENATE($K$4,\"2\"),$O$4:$XFD149,ROW()-3,FALSE),\"\")","v":""},{"$nulls":3},{"$f":"IF(OR($E149=\"\",$F149=\"\",O149=\"\",P149=\"\"),\"\",IF(AND(O149=$E149,P149=$F149),Reglement!$S$3*$J149,IF(SIGN($E149-$F149)=SIGN(O149-P149),Reglement!$S$4*$J149,0))*IF(AND($E149+$F149>=6,O149+P149>=6),Reglement!$S$29,IF(AND($E149+$F149>=4,O149+P149>=4),Reglement!$S$28,1)))","v":""}]
[null,null,{"$f":"Score!F193","v":"Wolverhampton"},{"$f":"Score!I193","v":"West Ham"},{"$f":"IF(Score!G193<>\"\",Score!G193,\"\")","v":""},{"$f":"IF(Score!H193<>\"\",Score!H193,\"\")","v":""},1,1,1,"",{"$f":"IF($K$4<>0,HLOOKUP($K$4,$O$4:$XFD150,ROW()-3,FALSE),\"\")","v":""},{"$f":"IF($K$4<>0,HLOOKUP(CONCATENATE($K$4,\"1\"),$O$4:$XFD150,ROW()-3,FALSE),\"\")","v":""},{"$f":"IF($K$4<>0,HLOOKUP(CONCATENATE($K$4,\"2\"),$O$4:$XFD150,ROW()-3,FALSE),\"\")","v":""},{"$nulls":3},{"$f":"IF(OR($E150=\"\",$F150=\"\",O150=\"\",P150=\"\"),\"\",IF(AND(O150=$E150,P150=$F150),Reglement!$S$3*$J150,IF(SIGN($E150-$F150)=SIGN(O150-P150),Reglement!$S$4*$J150,0))*IF(AND($E150+$F150>=6,O150+P150>=6),Reglement!$S$29,IF(AND($E150+$F150>=4,O150+P150>=4),Reglement!$S$28,1)))","v":""}]
[null,null,{"$f":"Score!F194","v":"Manchester United"},{"$f":"Score!I194","v":"Tottenham"},{"$f":"IF(Score!G194<>\"\",Score!G194,\"\")","v":""},{"$f":"IF(Score!H194<>\"\",Score!H194,\"\")","v":""},1,1,1,{"$f":"IF(OR(E151=\"\",F151=\"\"),\"\",IF(E151>F151,G151,IF(E151=F151,H151,I151)))","v":""},{"$f":"IF($K$4<>0,HLOOKUP($K$4,$O$4:$XFD151,ROW()-3,FALSE),\"\")","v":""},{"$f":"IF($K$4<>0,HLOOKUP(CONCATENATE($K$4,\"1\"),$O$4:$XFD151,ROW()-3,FALSE),\"\")","v":""},{"$f":"IF($K$4<>0,HLOOKUP(CONCATENATE($K$4,\"2\"),$O$4:$XFD151,ROW()-3,FALSE),\"\")","v":""},{"$nulls":3},{"$f":"IF(OR($E151=\"\",$F151=\"\",O151=\"\",P151=\"\"),\"\",IF(AND(O151=$E151,P151=$F151),Reglement!$S$3*$J151,IF(SIGN($E151-$F151)=SIGN(O151-P151),Reglement!$S$4*$J151,0))*IF(AND($E151+$F151>=6,O151+P151>=6),Reglement!$S$29,IF(AND($E151+$F151>=4,O151+P151>=4),Reglement!$S$28,1)))","v":""}]
[null,null,{"$f":"Score!F195","v":"Chelsea"},{"$f":"Score!I195","v":"Aston Villa"},{"$f":"IF(Score!G195<>\"\",Score!G195,\"\")","v":""},{"$f":"IF(Score!H195<>\"\",Score!H195,\"\")","v":""},1,1,1,"",{"$f":"IF($K$4<>0,HLOOKUP($K$4,$O$4:$XFD152,ROW()-3,FALSE),\"\")","v":""},{"$f":"IF($K$4<>0,HLOOKUP(CONCATENATE($K$4,\"1\"),$O$4:$XFD152,ROW()-3,FALSE),\"\")","v":""},{"$f":"IF($K$4<>0,HLOOKUP(CONCATENATE($K$4,\"2\"),$O$4:$XFD152,ROW()-3,FALSE),\"\")","v":""},{"$nulls":3},{"$f":"IF(OR($E152=\"\",$F152=\"\",O152=\"\",P152=\"\"),\"\",IF(AND(O152=$E152,P152=$F152),Reglement!$S$3*$J152,IF(SIGN($E152-$F152)=SIGN(O152-P152),Reglement!$S$4*$J152,0))*IF(AND($E152+$F152>=6,O152+P152>=6),Reglement!$S$29,IF(AND($E152+$F152>=4,O152+P152>=4),Reglement!$S$28,1)))","v":""}]
[null,null,{"$f":"Score!F196","v":"Southampton"},{"$f":"Score!I196","v":"Norwich"},{"$f":"IF(Score!G196<>\"\",Score!G196,\"\")","v":""},{"$f":"IF(Score!H196<>\"\",Score!H196,\"\")","v":""},1,1,1,"",{"$f":"IF($K$4<>0,HLOOKUP($K$4,$O$4:$XFD153,ROW()-3,FALSE),\"\")","v":""},{"$f":"IF($K$4<>0,HLOOKUP(CONCATENATE($K$4,\"1\"),$O$4:$XFD153,ROW()-3,FALSE),\"\")","v":""},{"$f":"IF($K$4<>0,HLOOKUP(CONCATENATE($K$4,\"2\"),$O$4:$XFD153,ROW()-3,FALSE),\"\")","v":""},{"$nulls":3},{"$f":"IF(OR($E153=\"\",$F153=\"\",O153=\"\",P153=\"\"),\"\",IF(AND(O153=$E153,P153=$F153),Reglement!$S$3*$J153,IF(SIGN($E153-$F153)=SIGN(O153-P153),Reglement!$S$4*$J153,0))*IF(AND($E153+$F153>=6,O153+P153>=6),Reglement!$S$29,IF(AND($E153+$F153>=4,O153+P153>=4),Reglement!$S$28,1)))","v":""}]
[null,null,{"$f":"Score!F197","v":"Crystal Palace"},{"$f":"Score!I197","v":"Bournemouth"},{"$f":"IF(Score!G197<>\"\",Score!G197,\"\")","v":""},{"$f":"IF(Score!H197<>\"\",Score!H197,\"\")","v":""},1,1,1,"",{"$f":"IF($K$4<>0,HLOOKUP($K$4,$O$4:$XFD154,ROW()-3,FALSE),\"\")","v":""},{"$f":"IF($K$4<>0,HLOOKUP(CONCATENATE($K$4,\"1\"),$O$4:$XFD154,ROW()-3,FALSE),\"\")","v":""},{"$f":"IF($K$4<>0,HLOOKUP(CONCATENATE($K$4,\"2\"),$O$4:$XFD154,ROW()-3,FALSE),\"\")","v":""},{"$nulls":3},{"$f":"IF(OR($E154=\"\",$F154=\"\",O154=\"\",P154=\"\"),\"\",IF(AND(O154=$E154,P154=$F154),Reglement!$S$3*$J154,IF(SIGN($E154-$F154)=SIGN(O154-P154),Reglement!$S$4*$J154,0))*IF(AND($E154+$F154>=6,O154+P154>=6),Reglement!$S$29,IF(AND($E154+$F154>=4,O154+P154>=4),Reglement!$S$28,1)))","v":""}]
[null,null,{"$f":"Score!F198","v":"Liverpool"},{"$f":"Score!I198","v":"Everton"},{"$f":"IF(Score!G198<>\"\",Score!G198,\"\")","v":""},{"$f":"IF(Score!H198<>\"\",Score!H198,\"\")","v":""},1,1,1,{"$f":"IF(OR(E155=\"\",F155=\"\"),\"\",IF(E155>F155,G155,IF(E155=F155,H155,I155)))","v":""},{"$f":"IF($K$4<>0,HLOOKUP($K$4,$O$4:$XFD155,ROW()-3,FALSE),\"\")","v":""},{"$f":"IF($K$4<>0,HLOOKUP(CONCATENATE($K$4,\"1\"),$O$4:$XFD155,ROW()-3,FALSE),\"\")","v":""},{"$f":"IF($K$4<>0,HLOOKUP(CONCATENATE($K$4,\"2\"),$O$4:$XFD155,ROW()-3,FALSE),\"\")","v":""},{"$nulls":3},{"$f":"IF(OR($E155=\"\",$F155=\"\",O155=\"\",P155=\"\"),\"\",IF(AND(O155=$E155,P155=$F155),Reglement!$S$3*$J155,IF(SIGN($E155-$F155)=SIGN(O155-P155),Reglement!$S$4*$J155,0))*IF(AND($E155+$F155>=6,O155+P155>=6),Reglement!$S$29,IF(AND($E155+$F155>=4,O155+P155>=4),Reglement!$S$28,1)))","v":""}]
["JOURNEE n°16",null,{"$f":"Score!F202","v":"Bournemouth"},{"$f":"Score!I202","v":"Liverpool"},{"$f":"IF(Score!G202<>\"\",Score!G202,\"\")","v":""},{"$f":"IF(Score!H202<>\"\",Score!H202,\"\")","v":""},1,1,1,"",{"$f":"IF($K$4<>0,HLOOKUP($K$4,$O$4:$XFD156,ROW()-3,FALSE),\"\")","v":""},{"$f":"IF($K$4<>0,HLOOKUP(CONCATENATE($K$4,\"1\"),$O$4:$XFD156,ROW()-3,FALSE),\"\")","v":""},{"$f":"IF($K$4<>0,HLOOKUP(CONCATENATE($K$4,\"2\"),$O$4:$XFD156,ROW()-3,FALSE),\"\")","v":""},{"$nulls":3},{"$f":"IF(OR($E156=\"\",$F156=\"\",O156=\"\",P156=\"\"),\"\",IF(AND(O156=$E156,P156=$F156),Reglement!$S$3*$J156,IF(SIGN($E156-$F156)=SIGN(O156-P156),Reglement!$S$4*$J156,0))*IF(AND($E156+$F156>=6,O156+P156>=6),Reglement!$S$29,IF(AND($E156+$F156>=4,O156+P156>=4),Reglement!$S$28,1)))","v":""}]
[null,null,{"$f":"Score!F203","v":"Aston Villa"},{"$f":"Score!I203","v":"Leicester City"},{"$f":"IF(Score!G203<>\"\",Score!G203,\"\")","v":""},{"$f":"IF(Score!H203<>\"\",Score!H203,\"\")","v":""},1,1,1,"",{"$f":"IF($K$4<>0,HLOOKUP($K$4,$O$4:$XFD157,ROW()-3,FALSE),\"\")","v":""},{"$f":"IF($K$4<>0,HLOOKUP(CONCATENATE($K$4,\"1\"),$O$4:$XFD157,ROW()-3,FALSE),\"\")","v":""},{"$f":"IF($K$4<>0,HLOOKUP(CONCATENATE($K$4,\"2\"),$O$4:$XFD157,ROW()-3,FALSE),\"\")","v":""},{"$nulls":3},{"$f":"IF(OR($E157=\"\",$F157=\"\",O157=\"\",P157=\"\"),\"\",IF(AND(O157=$E157,P157=$F157),Reglement!$S$3*$J157,IF(SIGN($E157-$F157)=SIGN(O157-P157),Reglement!$S$4*$J157,0))*IF(AND($E157+$F157>=6,O157+P157>=6),Reglement!$S$29,IF(AND($E157+$F157>=4,O157+P157>=4),Reglement!$S$28,1)))","v":""}]
[null,null,{"$f":"Score!F204","v":"Brighton"},{"$f":"Score!I204","v":"Wolverhampton"},{"$f":"IF(Score!G204<>\"\",Score!G204,\"\")","v":""},{"$f":"IF(Score!H204<>\"\",Score!H204,\"\")","v":""},1,1,1,"",{"$f":"IF($K$4<>0,HLOOKUP($K$4,$O$4:$XFD158,ROW()-3,FALSE),\"\")","v":""},{"$f":"IF($K$4<>0,HLOOKUP(CONCATENATE($K$4,\"1\"),$O$4:$XFD158,ROW()-3,FALSE),\"\")","v":""},{"$f":"IF($K$4<>0,HLOOKUP(CONCATENATE($K$4,\"2\"),$O$4:$XFD158,ROW()-3,FALSE),\"\")","v":""},{"$nulls":3},{"$f":"IF(OR($E158=\"\",$F158=\"\",O158=\"\",P158=\"\"),\"\",IF(AND(O158=$E158,P158=$F158),Reglement!$S$3*$J158,IF(SIGN($E158-$F158)=SIGN(O158-P158),Reglement!$S$4*$J158,0))*IF(AND($E158+$F158>=6,O158+P158>=6),Reglement!$S$29,IF(AND($E158+$F158>=4,O158+P158>=4),Reglement!$S$28,1)))","v":""}]
[null,null,{"$f":"Score!F205","v":"Everton"},{"$f":"Score!I205","v":"Chelsea"},{"$f":"IF(Score!G205<>\"\",Score!G205,\"\")","v":""},{"$f":"IF(Score!H205<>\"\",Score!H205,\"\")","v":""},1,1,1,"",{"$f":"IF($K$4<>0,HLOOKUP($K$4,$O$4:$XFD159,ROW()-3,FALSE),\"\")","v":""},{"$f":"IF($K$4<>0,HLOOKUP(CONCATENATE($K$4,\"1\"),$O$4:$XFD159,ROW()-3,FALSE),\"\")","v":""},{"$f":"IF($K$4<>0,HLOOKUP(CONCATENATE($K$4,\"2\"),$O$4:$XFD159,ROW()-3,FALSE),\"\")","v":""},{"$nulls":3},{"$f":"IF(OR($E159=\"\",$F159=\"\",O159=\"\",P159=\"\"),\"\",IF(AND(O159=$E159,P159=$F159),Reglement!$S$3*$J159,IF(SIGN($E159-$F159)=SIGN(O159-P159),Reglement!$S$4*$J159,0))*IF(AND($E159+$F159>=6,O159+P159>=6),Reglement!$S$29,IF(AND($E159+$F159>=4,O159+P159>=4),Reglement!$S$28,1)))","v":""}]
[null,null,{"$f":"Score!F206","v":"Manchester City"},{"$f":"Score!I206","v":"Manchester United"},{"$f":"IF(Score!G206<>\"\",Score!G206,\"\")","v":""},{"$f":"IF(Score!H206<>\"\",Score!H206,\"\")","v":""},1,1,1,{"$f":"IF(OR(E160=\"\",F160=\"\"),\"\",IF(E160>F160,G160,IF(E160=F160,H160,I160)))","v":""},{"$f":"IF($K$4<>0,HLOOKUP($K$4,$O$4:$XFD160,ROW()-3,FALSE),\"\")","v":""},{"$f":"IF($K$4<>0,HLOOKUP(CONCATENATE($K$4,\"1\"),$O$4:$XFD160,ROW()-3,FALSE),\"\")","v":""},{"$f":"IF($K$4<>0,HLOOKUP(CONCATENATE($K$4,\"2\"),$O$4:$XFD160,ROW()-3,FALSE),\"\")","v":""},{"$nulls":3},{"$f":"IF(OR($E160=\"\",$F160=\"\",O160=\"\",P160=\"\"),\"\",IF(AND(O160=$E160,P160=$F160),Reglement!$S$3*$J160,IF(SIGN($E160-$F160)=SIGN(O160-P160),Reglement!$S$4*$J160,0))*IF(AND($E160+$F160>=6,O160+P160>=6),Reglement!$S$29,IF(AND($E160+$F160>=4,O160+P160>=4),Reglement!$S$28,1)))","v":""}]
[null,null,{"$f":"Score!F207","v":"Newcastle"},{"$f":"Score!I207","v":"Southampton"},{"$f":"IF(Score!G207<>\"\",Score!G207,\"\")","v":""},{"$f":"IF(Score!H207<>\"\",Score!H207,\"\")","v":""},1,1,1,"",{"$f":"IF($K$4<>0,HLOOKUP($K$4,$O$4:$XFD161,ROW()-3,FALSE),\"\")","v":""},{"$f":"IF($K$4<>0,HLOOKUP(CONCATENATE($K$4,\"1\"),$O$4:$XFD161,ROW()-3,FALSE),\"\")","v":""},{"$f":"IF($K$4<>0,HLOOKUP(CONCATENATE($K$4,\"2\"),$O$4:$XFD161,ROW()-3,FALSE),\"\")","v":""},{"$nulls":3},{"$f":"IF(OR($E161=\"\",$F161=\"\",O161=\"\",P161=\"\"),\"\",IF(AND(O161=$E161,P161=$F161),Reglement!$S$3*$J161,IF(SIGN($E161-$F161)=SIGN(O161-P161),Reglement!$S$4*$J161,0))*IF(AND($E161+$F161>=6,O161+P161>=6),Reglement!$S$29,IF(AND($E161+$F161>=4,O161+P161>=4),Reglement!$S$28,1)))","v":""}]
[null,null,{"$f":"Score!F208","v":"Norwich"},{"$f":"Score!I208","v":"Sheffield United"},{"$f":"IF(Score!G208<>\"\",Score!G208,\"\")","v":""},{"$f":"IF(Score!H208<>\"\",Score!H208,\"\")","v":""},1,1,1,"",{"$f":"IF($K$4<>0,HLOOKUP($K$4,$O$4:$XFD162,ROW()-3,FALSE),\"\")","v":""},{"$f":"IF($K$4<>0,HLOOKUP(CONCATENATE($K$4,\"1\"),$O$4:$XFD162,ROW()-3,FALSE),\"\")","v":""},{"$f":"IF($K$4<>0,HLOOKUP(CONCATENATE($K$4,\"2\"),$O$4:$XFD162,ROW()-3,FALSE),\"\")","v":""},{"$nulls":3},{"$f":"IF(OR($E162=\"\",$F162=\"\",O162=\"\",P162=\"\"),\"\",IF(AND(O162=$E162,P162=$F162),Reglement!$S$3*$J162,IF(SIGN($E162-$F162)=SIGN(O162-P162),Reglement!$S$4*$J162,0))*IF(AND($E162+$F162>=6,O162+P162>=6),Reglement!$S$29,IF(AND($E162+$F162>=4,O162+P162>=4),Reglement!$S$28,1)))","v":""}]
[null,null,{"$f":"Score!F209","v":"Tottenham"},{"$f":"Score!I209","v":"Burnley"},{"$f":"IF(Score!G209<>\"\",Score!G209,\"\")","v":""},{"$f":"IF(Score!H209<>\"\",Score!H209,\"\")","v":""},1,1,1,"",{"$f":"IF($K$4<>0,HLOOKUP($K$4,$O$4:$XFD163,ROW()-3,FALSE),\"\")","v":""},{"$f":"IF($K$4<>0,HLOOKUP(CONCATENATE($K$4,\"1\"),$O$4:$XFD163,ROW()-3,FALSE),\"\")","v":""},{"$f":"IF($K$4<>0,HLOOKUP(CONCATENATE($K$4,\"2\"),$O$4:$XFD163,ROW()-3,FALSE),\"\")","v":""},{"$nulls":3},{"$f":"IF(OR($E163=\"\",$F163=\"\",O163=\"\",P163=\"\"),\"\",IF(AND(O163=$E163,P163=$F163),Reglement!$S$3*$J163,IF(SIGN($E163-$F163)=SIGN(O163-P163),Reglement!$S$4*$J163,0))*IF(AND($E163+$F163>=6,O163+P163>=6),Reglement!$S$29,IF(AND($E163+$F163>=4,O163+P163>=4),Reglement!$S$28,1)))","v":""}]
[null,null,{"$f":"Score!F210","v":"Watford"},{"$f":"Score!I210","v":"Crystal Palace"},{"$f":"IF(Score!G210<>\"\",Score!G210,\"\")","v":""},{"$f":"IF(Score!H210<>\"\",Score!H210,\"\")","v":""},1,1,1,"",{"$f":"IF($K$4<>0,HLOOKUP($K$4,$O$4:$XFD164,ROW()-3,FALSE),\"\")","v":""},{"$f":"IF($K$4<>0,HLOOKUP(CONCATENATE($K$4,\"1\"),$O$4:$XFD164,ROW()-3,FALSE),\"\")","v":""},{"$f":"IF($K$4<>0,HLOOKUP(CONCATENATE($K$4,\"2\"),$O$4:$XFD164,ROW()-3,FALSE),\"\")","v":""},{"$nulls":3},{"$f":"IF(OR($E164=\"\",$F164=\"\",O164=\"\",P164=\"\"),\"\",IF(AND(O164=$E164,P164=$F164),Reglement!$S$3*$J164,IF(SIGN($E164-$F164)=SIGN(O164-P164),Reglement!$S$4*$J164,0))*IF(AND($E164+$F164>=6,O164+P164>=6),Reglement!$S$29,IF(AND($E164+$F164>=4,O164+P164>=4),Reglement!$S$28,1)))","v":""}]
[null,null,{"$f":"Score!F211","v":"West Ham"},{"$f":"Score!I211","v":"Arsenal"},{"$f":"IF(Score!G211<>\"\",Score!G211,\"\")","v":""},{"$f":"IF(Score!H211<>\"\",Score!H211,\"\")","v":""},1,1,1,"",{"$f":"IF($K$4<>0,HLOOKUP($K$4,$O$4:$XFD165,ROW()-3,FALSE),\"\")","v":""},{"$f":"IF($K$4<>0,HLOOKUP(CONCATENATE($K$4,\"1\"),$O$4:$XFD165,ROW()-3,FALSE),\"\")","v":""},{"$f":"IF($K$4<>0,HLOOKUP(CONCATENATE($K$4,\"2\"),$O$4:$XFD165,ROW()-3,FALSE),\"\")","v":""},{"$nulls":3},{"$f":"IF(OR($E165=\"\",$F165=\"\",O165=\"\",P165=\"\"),\"\",IF(AND(O165=$E165,P165=$F165),Reglement!$S$3*$J165,IF(SIGN($E165-$F165)=SIGN(O165-P165),Reglement!$S$4*$J165,0))*IF(AND($E165+$F165>=6,O165+P165>=6),Reglement!$S$29,IF(AND($E165+$F165>=4,O165+P165>=4),Reglement!$S$28,1)))","v":""}]
["JOURNEE n°17",null,{"$f":"Score!F215","v":"Arsenal"},{"$f":"Score!I215","v":"Manchester City"},{"$f":"IF(Score!G215<>\"\",Score!G215,\"\")","v":""},{"$f":"IF(Score!H215<>\"\",Score!H215,\"\")","v":""},1,1,1,"",{"$f":"IF($K$4<>0,HLOOKUP($K$4,$O$4:$XFD166,ROW()-3,FALSE),\"\")","v":""},{"$f":"IF($K$4<>0,HLOOKUP(CONCATENATE($K$4,\"1\"),$O$4:$XFD166,ROW()-3,FALSE),\"\")","v":""},{"$f":"IF($K$4<>0,HLOOKUP(CONCATENATE($K$4,\"2\"),$O$4:$XFD166,ROW()-3,FALSE),\"\")","v":""},{"$nulls":3},{"$f":"IF(OR($E166=\"\",$F166=\"\",O166=\"\",P166=\"\"),\"\",IF(AND(O166=$E166,P166=$F166),Reglement!$S$3*$J166,IF(SIGN($E166-$F166)=SIGN(O166-P166),Reglement!$S$4*$J166,0))*IF(AND($E166+$F166>=6,O166+P166>=6),Reglement!$S$29,IF(AND($E166+$F166>=4,O166+P166>=4),Reglement!$S$28,1)))","v":""}]
[null,null,{"$f":"Score!F216","v":"Burnley"},{"$f":"Score!I216","v":"Newcastle"},{"$f":"IF(Score!G216<>\"\",Score!G216,\"\")","v":""},{"$f":"IF(Score!H216<>\"\",Score!H216,\"\")","v":""},1,1,1,"",{"$f":"IF($K$4<>0,HLOOKUP($K$4,$O$4:$XFD167,ROW()-3,FALSE),\"\")","v":""},{"$f":"IF($K$4<>0,HLOOKUP(CONCATENATE($K$4,\"1\"),$O$4:$XFD167,ROW()-3,FALSE),\"\")","v":""},{"$f":"IF($K$4<>0,HLOOKUP(CONCATENATE($K$4,\"2\"),$O$4:$XFD167,ROW()-3,FALSE),\"\")","v":""},{"$nulls":3},{"$f":"IF(OR($E167=\"\",$F167=\"\",O167=\"\",P167=\"\"),\"\",IF(AND(O167=$E167,P167=$F167),Reglement!$S$3*$J167,IF(SIGN($E167-$F167)=SIGN(O167-P167),Reglement!$S$4*$J167,0))*IF(AND($E167+$F167>=6,O167+P167>=6),Reglement!$S$29,IF(AND($E167+$F167>=4,O167+P167>=4),Reglement!$S$28,1)))","v":""}]
[null,null,{"$f":"Score!F217","v":"Chelsea"},{"$f":"Score!I217","v":"Bournemouth"},{"$f":"IF(Score!G217<>\"\",Score!G217,\"\")","v":""},{"$f":"IF(Score!H217<>\"\",Score!H217,\"\")","v":""},1,1,1,"",{"$f":"IF($K$4<>0,HLOOKUP($K$4,$O$4:$XFD168,ROW()-3,FALSE),\"\")","v":""},{"$f":"IF($K$4<>0,HLOOKUP(CONCATENATE($K$4,\"1\"),$O$4:$XFD168,ROW()-3,FALSE),\"\")","v":""},{"$f":"IF($K$4<>0,HLOOKUP(CONCATENATE($K$4,\"2\"),$O$4:$XFD168,ROW()-3,FALSE),\"\")","v":""},{"$nulls":3},{"$f":"IF(OR($E168=\"\",$F168=\"\",O168=\"\",P168=\"\"),\"\",IF(AND(O168=$E168,P168=$F168),Reglement!$S$3*$J168,IF(SIGN($E168-$F168)=SIGN(O168-P168),Reglement!$S$4*$J168,0))*IF(AND($E168+$F168>=6,O168+P168>=6),Reglement!$S$29,IF(AND($E168+$F168>=4,O168+P168>=4),Reglement!$S$28,1)))","v":""}]
[null,null,{"$f":"Score!F218","v":"Crystal Palace"},{"$f":"Score!I218","v":"Brighton"},{"$f":"IF(Score!G218<>\"\",Score!G218,\"\")","v":""},{"$f":"IF(Score!H218<>\"\",Score!H218,\"\")","v":""},1,1,1,"",{"$f":"IF($K$4<>0,HLOOKUP($K$4,$O$4:$XFD169,ROW()-3,FALSE),\"\")","v":""},{"$f":"IF($K$4<>0,HLOOKUP(CONCATENATE($K$4,\"1\"),$O$4:$XFD169,ROW()-3,FALSE),\"\")","v":""},{"$f":"IF($K$4<>0,HLOOKUP(CONCATENATE($K$4,\"2\"),$O$4:$XFD169,ROW()-3,FALSE),\"\")","v":""},{"$nulls":3},{"$f":"IF(OR($E169=\"\",$F169=\"\",O169=\"\",P169=\"\"),\"\",IF(AND(O169=$E169,P169=$F169),Reglement!$S$3*$J169,IF(SIGN($E169-$F169)=SIGN(O169-P169),Reglement!$S$4*$J169,0))*IF(AND($E169+$F169>=6,O169+P169>=6),Reglement!$S$29,IF(AND($E169+$F169>=4,O169+P169>=4),Reglement!$S$28,1)))","v":""}]
[null,null,{"$f":"Score!F219","v":"Leicester City"},{"$f":"Score!I219","v":"Norwich"},{"$f":"IF(Score!G219<>\"\",Score!G219,\"\")","v":""},{"$f":"IF(Score!H219<>\"\",Score!H219,\"\")","v":""},1,1,1,"",{"$f":"IF($K$4<>0,HLOOKUP($K$4,$O$4:$XFD170,ROW()-3,FALSE),\"\")","v":""},{"$f":"IF($K$4<>0,HLOOKUP(CONCATENATE($K$4,\"1\"),$O$4:$XFD170,ROW()-3,FALSE),\"\")","v":""},{"$f":"IF($K$4<>0,HLOOKUP(CONCATENATE($K$4,\"2\"),$O$4:$XFD170,ROW()-3,FALSE),\"\")","v":""},{"$nulls":3},{"$f":"IF(OR($E170=\"\",$F170=\"\",O170=\"\",P170=\"\"),\"\",IF(AND(O170=$E170,P170=$F170),Reglement!$S$3*$J170,IF(SIGN($E170-$F170)=SIGN(O170-P170),Reglement!$S$4*$J170,0))*IF(AND($E170+$F170>=6,O170+P170>=6),Reglement!$S$29,IF(AND($E170+$F170>=4,O170+P170>=4),Reglement!$S$28,1)))","v":""}]
[null,null,{"$f":"Score!F220","v":"Liverpool"},{"$f":"Score!I220","v":"Watford"},{"$f":"IF(Score!G220<>\"\",Score!G220,\"\")","v":""},{"$f":"IF(Score!H220<>\"\",Score!H220,\"\")","v":""},1,1,1,"",{"$f":"IF($K$4<>0,HLOOKUP($K$4,$O$4:$XFD171,ROW()-3,FALSE),\"\")","v":""},{"$f":"IF($K$4<>0,HLOOKUP(CONCATENATE($K$4,\"1\"),$O$4:$XFD171,ROW()-3,FALSE),\"\")","v":""},{"$f":"IF($K$4<>0,HLOOKUP(CONCATENATE($K$4,\"2\"),$O$4:$XFD171,ROW()-3,FALSE),\"\")","v":""},{"$nulls":3},{"$f":"IF(OR($E171=\"\",$F171=\"\",O171=\"\",P171=\"\"),\"\",IF(AND(O171=$E171,P171=$F171),Reglement!$S$3*$J171,IF(SIGN($E171-$F171)=SIGN(O171-P171),Reglement!$S$4*$J171,0))*IF(AND($E171+$F171>=6,O171+P171>=6),Reglement!$S$29,IF(AND($E171+$F171>=4,O171+P171>=4),Reglement!$S$28,1)))","v":""}]
[null,null,{"$f":"Score!F221","v":"Manchester United"},{"$f":"Score!I221","v":"Everton"},{"$f":"IF(Score!G221<>\"\",Score!G221,\"\")","v":""},{"$f":"IF(Score!H221<>\"\",Score!H221,\"\")","v":""},1,1,1,"",{"$f":"IF($K$4<>0,HLOOKUP($K$4,$O$4:$XFD172,ROW()-3,FALSE),\"\")","v":""},{"$f":"IF($K$4<>0,HLOOKUP(CONCATENATE($K$4,\"1\"),$O$4:$XFD172,ROW()-3,FALSE),\"\")","v":""},{"$f":"IF($K$4<>0,HLOOKUP(CONCATENATE($K$4,\"2\"),$O$4:$XFD172,ROW()-3,FALSE),\"\")","v":""},{"$nulls":3},{"$f":"IF(OR($E172=\"\",$F172=\"\",O172=\"\",P172=\"\"),\"\",IF(AND(O172=$E172,P172=$F172),Reglement!$S$3*$J172,IF(SIGN($E172-$F172)=SIGN(O172-P172),Reglement!$S$4*$J172,0))*IF(AND($E172+$F172>=6,O172+P172>=6),Reglement!$S$29,IF(AND($E172+$F172>=4,O172+P172>=4),Reglement!$S$28,1)))","v":""}]
[null,null,{"$f":"Score!F222","v":"Sheffield United"},{"$f":"Score!I222","v":"Aston Villa"},{"$f":"IF(Score!G222<>\"\",Score!G222,\"\")","v":""},{"$f":"IF(Score!H222<>\"\",Score!H222,\"\")","v":""},1,1,1,"",{"$f":"IF($K$4<>0,HLOOKUP($K$4,$O$4:$XFD173,ROW()-3,FALSE),\"\")","v":""},{"$f":"IF($K$4<>0,HLOOKUP(CONCATENATE($K$4,\"1\"),$O$4:$XFD173,ROW()-3,FALSE),\"\")","v":""},{"$f":"IF($K$4<>0,HLOOKUP(CONCATENATE($K$4,\"2\"),$O$4:$XFD173,ROW()-3,FALSE),\"\")","v":""},{"$nulls":3},{"$f":"IF(OR($E173=\"\",$F173=\"\",O173=\"\",P173=\"\"),\"\",IF(AND(O173=$E173,P173=$F173),Reglement!$S$3*$J173,IF(SIGN($E173-$F173)=SIGN(O173-P173),Reglement!$S$4*$J173,0))*IF(AND($E173+$F173>=6,O173+P173>=6),Reglement!$S$29,IF(AND($E173+$F173>=4,O173+P173>=4),Reglement!$S$28,1)))","v":""}]
[null,null,{"$f":"Score!F223","v":"Southampton"},{"$f":"Score!I223","v":"West Ham"},{"$f":"IF(Score!G223<>\"\",Score!G223,\"\")","v":""},{"$f":"IF(Score!H223<>\"\",Score!H223,\"\")","v":""},1,1,1,"",{"$f":"IF($K$4<>0,HLOOKUP($K$4,$O$4:$XFD174,ROW()-3,FALSE),\"\")","v":""},{"$f":"IF($K$4<>0,HLOOKUP(CONCATENATE($K$4,\"1\"),$O$4:$XFD174,ROW()-3,FALSE),\"\")","v":""},{"$f":"IF($K$4<>0,HLOOKUP(CONCATENATE($K$4,\"2\"),$O$4:$XFD174,ROW()-3,FALSE),\"\")","v":""},{"$nulls":3},{"$f":"IF(OR($E174=\"\",$F174=\"\",O174=\"\",P174=\"\"),\"\",IF(AND(O174=$E174,P174=$F174),Reglement!$S$3*$J174,IF(SIGN($E174-$F174)=SIGN(O174-P174),Reglement!$S$4*$J174,0))*IF(AND($E174+$F174>=6,O174+P174>=6),Reglement!$S$29,IF(AND($E174+$F174>=4,O174+P174>=4),Reglement!$S$28,1)))","v":""}]
[null,null,{"$f":"Score!F224","v":"Wolverhampton"},{"$f":"Score!I224","v":"Tottenham"},{"$f":"IF(Score!G224<>\"\",Score!G224,\"\")","v":""},{"$f":"IF(Score!H224<>\"\",Score!H224,\"\")","v":""},1,1,1,"",{"$f":"IF($K$4<>0,HLOOKUP($K$4,$O$4:$XFD175,ROW()-3,FALSE),\"\")","v":""},{"$f":"IF($K$4<>0,HLOOKUP(CONCATENATE($K$4,\"1\"),$O$4:$XFD175,ROW()-3,FALSE),\"\")","v":""},{"$f":"IF($K$4<>0,HLOOKUP(CONCATENATE($K$4,\"2\"),$O$4:$XFD175,ROW()-3,FALSE),\"\")","v":""},{"$nulls":3},{"$f":"IF(OR($E175=\"\",$F175=\"\",O175=\"\",P175=\"\"),\"\",IF(AND(O175=$E175,P175=$F175),Reglement!$S$3*$J175,IF(SIGN($E175-$F175)=SIGN(O175-P175),Reglement!$S$4*$J175,0))*IF(AND($E175+$F175>=6,O175+P175>=6),Reglement!$S$29,IF(AND($E175+$F175>=4,O175+P175>=4),Reglement!$S$28,1)))","v":""}]
["JOURNEE n°18",null,{"$f":"Score!F228","v":"Bournemouth"},{"$f":"Score!I228","v":"Burnley"},{"$f":"IF(Score!G228<>\"\",Score!G228,\"\")","v":""},{"$f":"IF(Score!H228<>\"\",Score!H228,\"\")","v":""},1,1,1,"",{"$f":"IF($K$4<>0,HLOOKUP($K$4,$O$4:$XFD176,ROW()-3,FALSE),\"\")","v":""},{"$f":"IF($K$4<>0,HLOOKUP(CONCATENATE($K$4,\"1\"),$O$4:$XFD176,ROW()-3,FALSE),\"\")","v":""},{"$f":"IF($K$4<>0,HLOOKUP(CONCATENATE($K$4,\"2\"),$O$4:$XFD176,ROW()-3,FALSE),\"\")","v":""},{"$nulls":3},{"$f":"IF(OR($E176=\"\",$F176=\"\",O176=\"\",P176=\"\"),\"\",IF(AND(O176=$E176,P176=$F176),Reglement!$S$3*$J176,IF(SIGN($E176-$F176)=SIGN(O176-P176),Reglement!$S$4*$J176,0))*IF(AND($E176+$F176>=6,O176+P176>=6),Reglement!$S$29,IF(AND($E176+$F176>=4,O176+P176>=4),Reglement!$S$28,1)))","v":""}]
[null,null,{"$f":"Score!F229","v":"Aston Villa"},{"$f":"Score!I229","v":"Southampton"},{"$f":"IF(Score!G229<>\"\",Score!G229,\"\")","v":""},{"$f":"IF(Score!H229<>\"\",Score!H229,\"\")","v":""},1,1,1,"",{"$f":"IF($K$4<>0,HLOOKUP($K$4,$O$4:$XFD177,ROW()-3,FALSE),\"\")","v":""},{"$f":"IF($K$4<>0,HLOOKUP(CONCATENATE($K$4,\"1\"),$O$4:$XFD177,ROW()-3,FALSE),\"\")","v":""},{"$f":"IF($K$4<>0,HLOOKUP(CONCATENATE($K$4,\"2\"),$O$4:$XFD177,ROW()-3,FALSE),\"\")","v":""},{"$nulls":3},{"$f":"IF(OR($E177=\"\",$F177=\"\",O177=\"\",P177=\"\"),\"\",IF(AND(O177=$E177,P177=$F177),Reglement!$S$3*$J177,IF(SIGN($E177-$F177)=SIGN(O177-P177),Reglement!$S$4*$J177,0))*IF(AND($E177+$F177>=6,O177+P177>=6),Reglement!$S$29,IF(AND($E177+$F177>=4,O177+P177>=4),Reglement!$S$28,1)))","v":""}]
[null,null,{"$f":"Score!F230","v":"Brighton"},{"$f":"Score!I230","v":"Sheffield United"},{"$f":"IF(Score!G230<>\"\",Score!G230,\"\")","v":""},{"$f":"IF(Score!H230<>\"\",Score!H230,\"\")","v":""},1,1,1,"",{"$f":"IF($K$4<>0,HLOOKUP($K$4,$O$4:$XFD178,ROW()-3,FALSE),\"\")","v":""},{"$f":"IF($K$4<>0,HLOOKUP(CONCATENATE($K$4,\"1\"),$O$4:$XFD178,ROW()-3,FALSE),\"\")","v":""},{"$f":"IF($K$4<>0,HLOOKUP(CONCATENATE($K$4,\"2\"),$O$4:$XFD178,ROW()-3,FALSE),\"\")","v":""},{"$nulls":3},{"$f":"IF(OR($E178=\"\",$F178=\"\",O178=\"\",P178=\"\"),\"\",IF(AND(O178=$E178,P178=$F178),Reglement!$S$3*$J178,IF(SIGN($E178-$F178)=SIGN(O178-P178),Reglement!$S$4*$J178,0))*IF(AND($E178+$F178>=6,O178+P178>=6),Reglement!$S$29,IF(AND($E178+$F178>=4,O178+P178>=4),Reglement!$S$28,1)))","v":""}]
[null,null,{"$f":"Score!F231","v":"Everton"},{"$f":"Score!I231","v":"Arsenal"},{"$f":"IF(Score!G231<>\"\",Score!G231,\"\")","v":""},{"$f":"IF(Score!H231<>\"\",Score!H231,\"\")","v":""},1,1,1,"",{"$f":"IF($K$4<>0,HLOOKUP($K$4,$O$4:$XFD179,ROW()-3,FALSE),\"\")","v":""},{"$f":"IF($K$4<>0,HLOOKUP(CONCATENATE($K$4,\"1\"),$O$4:$XFD179,ROW()-3,FALSE),\"\")","v":""},{"$f":"IF($K$4<>0,HLOOKUP(CONCATENATE($K$4,\"2\"),$O$4:$XFD179,ROW()-3,FALSE),\"\")","v":""},{"$nulls":3},{"$f":"IF(OR($E179=\"\",$F179=\"\",O179=\"\",P179=\"\"),\"\",IF(AND(O179=$E179,P179=$F179),Reglement!$S$3*$J179,IF(SIGN($E179-$F179)=SIGN(O179-P179),Reglement!$S$4*$J179,0))*IF(AND($E179+$F179>=6,O179+P179>=6),Reglement!$S$29,IF(AND($E179+$F179>=4,O179+P179>=4),Reglement!$S$28,1)))","v":""}]
[null,null,{"$f":"Score!F232","v":"Manchester City"},{"$f":"Score!I232","v":"Leicester City"},{"$f":"IF(Score!G232<>\"\",Score!G232,\"\")","v":""},{"$f":"IF(Score!H232<>\"\",Score!H232,\"\")","v":""},1,1,1,"",{"$f":"IF($K$4<>0,HLOOKUP($K$4,$O$4:$XFD180,ROW()-3,FALSE),\"\")","v":""},{"$f":"IF($K$4<>0,HLOOKUP(CONCATENATE($K$4,\"1\"),$O$4:$XFD180,ROW()-3,FALSE),\"\")","v":""},{"$f":"IF($K$4<>0,HLOOKUP(CONCATENATE($K$4,\"2\"),$O$4:$XFD180,ROW()-3,FALSE),\"\")","v":""},{"$nulls":3},{"$f":"IF(OR($E180=\"\",$F180=\"\",O180=\"\",P180=\"\"),\"\",IF(AND(O180=$E180,P180=$F180),Reglement!$S$3*$J180,IF(SIGN($E180-$F180)=SIGN(O180-P180),Reglement!$S$4*$J180,0))*IF(AND($E180+$F180>=6,O180+P180>=6),Reglement!$S$29,IF(AND($E180+$F180>=4,O180+P180>=4),Reglement!$S$28,1)))","v":""}]
[null,null,{"$f":"Score!F233","v":"Newcastle"},{"$f":"Score!I233","v":"Crystal Palace"},{"$f":"IF(Score!G233<>\"\",Score!G233,\"\")","v":""},{"$f":"IF(Score!H233<>\"\",Score!H233,\"\")","v":""},1,1,1,"",{"$f":"IF($K$4<>0,HLOOKUP($K$4,$O$4:$XFD181,ROW()-3,FALSE),\"\")","v":""},{"$f":"IF($K$4<>0,HLOOKUP(CONCATENATE($K$4,\"1\"),$O$4:$XFD181,ROW()-3,FALSE),\"\")","v":""},{"$f":"IF($K$4<>0,HLOOKUP(CONCATENATE($K$4,\"2\"),$O$4:$XFD181,ROW()-3,FALSE),\"\")","v":""},{"$nulls":3},{"$f":"IF(OR($E181=\"\",$F181=\"\",O181=\"\",P181=\"\"),\"\",IF(AND(O181=$E181,P181=$F181),Reglement!$S$3*$J181,IF(SIGN($E181-$F181)=SIGN(O181-P181),Reglement!$S$4*$J181,0))*IF(AND($E181+$F181>=6,O181+P181>=6),Reglement!$S$29,IF(AND($E181+$F181>=4,O181+P181>=4),Reglement!$S$28,1)))","v":""}]
[null,null,{"$f":"Score!F234","v":"Norwich"},{"$f":"Score!I234","v":"Wolverhampton"},{"$f":"IF(Score!G234<>\"\",Score!G234,\"\")","v":""},{"$f":"IF(Score!H234<>\"\",Score!H234,\"\")","v":""},1,1,1,"",{"$f":"IF($K$4<>0,HLOOKUP($K$4,$O$4:$XFD182,ROW()-3,FALSE),\"\")","v":""},{"$f":"IF($K$4<>0,HLOOKUP(CONCATENATE($K$4,\"1\"),$O$4:$XFD182,ROW()-3,FALSE),\"\")","v":""},{"$f":"IF($K$4<>0,HLOOKUP(CONCATENATE($K$4,\"2\"),$O$4:$XFD182,ROW()-3,FALSE),\"\")","v":""},{"$nulls":3},{"$f":"IF(OR($E182=\"\",$F182=\"\",O182=\"\",P182=\"\"),\"\",IF(AND(O182=$E182,P182=$F182),Reglement!$S$3*$J182,IF(SIGN($E182-$F182)=SIGN(O182-P182),Reglement!$S$4*$J182,0))*IF(AND($E182+$F182>=6,O182+P182>=6),Reglement!$S$29,IF(AND($E182+$F182>=4,O182+P182>=4),Reglement!$S$28,1)))","v":""}]
[null,null,{"$f":"Score!F235","v":"Tottenham"},{"$f":"Score!I235","v":"Chelsea"},{"$f":"IF(Score!G235<>\"\",Score!G235,\"\")","v":""},{"$f":"IF(Score!H235<>\"\",Score!H235,\"\")","v":""},1,1,1,"",{"$f":"IF($K$4<>0,HLOOKUP($K$4,$O$4:$XFD183,ROW()-3,FALSE),\"\")","v":""},{"$f":"IF($K$4<>0,HLOOKUP(CONCATENATE($K$4,\"1\"),$O$4:$XFD183,ROW()-3,FALSE),\"\")","v":""},{"$f":"IF($K$4<>0,HLOOKUP(CONCATENATE($K$4,\"2\"),$O$4:$XFD183,ROW()-3,FALSE),\"\")","v":""},{"$nulls":3},{"$f":"IF(OR($E183=\"\",$F183=\"\",O183=\"\",P183=\"\"),\"\",IF(AND(O183=$E183,P183=$F183),Reglement!$S$3*$J183,IF(SIGN($E183-$F183)=SIGN(O183-P183),Reglement!$S$4*$J183,0))*IF(AND($E183+$F183>=6,O183+P183>=6),Reglement!$S$29,IF(AND($E183+$F183>=4,O183+P183>=4),Reglement!$S$28,1)))","v":""}]
[null,null,{"$f":"Score!F236","v":"Watford"},{"$f":"Score!I236","v":"Manchester United"},{"$f":"IF(Score!G236<>\"\",Score!G236,\"\")","v":""},{"$f":"IF(Score!H236<>\"\",Score!H236,\"\")","v":""},1,1,1,"",{"$f":"IF($K$4<>0,HLOOKUP($K$4,$O$4:$XFD184,ROW()-3,FALSE),\"\")","v":""},{"$f":"IF($K$4<>0,HLOOKUP(CONCATENATE($K$4,\"1\"),$O$4:$XFD184,ROW()-3,FALSE),\"\")","v":""},{"$f":"IF($K$4<>0,HLOOKUP(CONCATENATE($K$4,\"2\"),$O$4:$XFD184,ROW()-3,FALSE),\"\")","v":""},{"$nulls":3},{"$f":"IF(OR($E184=\"\",$F184=\"\",O184=\"\",P184=\"\"),\"\",IF(AND(O184=$E184,P184=$F184),Reglement!$S$3*$J184,IF(SIGN($E184-$F184)=SIGN(O184-P184),Reglement!$S$4*$J184,0))*IF(AND($E184+$F184>=6,O184+P184>=6),Reglement!$S$29,IF(AND($E184+$F184>=4,O184+P184>=4),Reglement!$S$28,1)))","v":""}]
[null,null,{"$f":"Score!F237","v":"West Ham"},{"$f":"Score!I237","v":"Liverpool"},{"$f":"IF(Score!G237<>\"\",Score!G237,\"\")","v":""},{"$f":"IF(Score!H237<>\"\",Score!H237,\"\")","v":""},1,1,1,"",{"$f":"IF($K$4<>0,HLOOKUP($K$4,$O$4:$XFD185,ROW()-3,FALSE),\"\")","v":""},{"$f":"IF($K$4<>0,HLOOKUP(CONCATENATE($K$4,\"1\"),$O$4:$XFD185,ROW()-3,FALSE),\"\")","v":""},{"$f":"IF($K$4<>0,HLOOKUP(CONCATENATE($K$4,\"2\"),$O$4:$XFD185,ROW()-3,FALSE),\"\")","v":""},{"$nulls":3},{"$f":"IF(OR($E185=\"\",$F185=\"\",O185=\"\",P185=\"\"),\"\",IF(AND(O185=$E185,P185=$F185),Reglement!$S$3*$J185,IF(SIGN($E185-$F185)=SIGN(O185-P185),Reglement!$S$4*$J185,0))*IF(AND($E185+$F185>=6,O185+P185>=6),Reglement!$S$29,IF(AND($E185+$F185>=4,O185+P185>=4),Reglement!$S$28,1)))","v":""}]
["JOURNEE n°19",null,{"$f":"Score!F241","v":"Bournemouth"},{"$f":"Score!I241","v":"Arsenal"},{"$f":"IF(Score!G241<>\"\",Score!G241,\"\")","v":""},{"$f":"IF(Score!H241<>\"\",Score!H241,\"\")","v":""},1,1,1,"",{"$f":"IF($K$4<>0,HLOOKUP($K$4,$O$4:$XFD186,ROW()-3,FALSE),\"\")","v":""},{"$f":"IF($K$4<>0,HLOOKUP(CONCATENATE($K$4,\"1\"),$O$4:$XFD186,ROW()-3,FALSE),\"\")","v":""},{"$f":"IF($K$4<>0,HLOOKUP(CONCATENATE($K$4,\"2\"),$O$4:$XFD186,ROW()-3,FALSE),\"\")","v":""},{"$nulls":3},{"$f":"IF(OR($E186=\"\",$F186=\"\",O186=\"\",P186=\"\"),\"\",IF(AND(O186=$E186,P186=$F186),Reglement!$S$3*$J186,IF(SIGN($E186-$F186)=SIGN(O186-P186),Reglement!$S$4*$J186,0))*IF(AND($E186+$F186>=6,O186+P186>=6),Reglement!$S$29,IF(AND($E186+$F186>=4,O186+P186>=4),Reglement!$S$28,1)))","v":""}]
[null,null,{"$f":"Score!F242","v":"Aston Villa"},{"$f":"Score!I242","v":"Norwich"},{"$f":"IF(Score!G242<>\"\",Score!G242,\"\")","v":""},{"$f":"IF(Score!H242<>\"\",Score!H242,\"\")","v":""},1,1,1,{"$f":"IF(OR(E187=\"\",F187=\"\"),\"\",IF(E187>F187,G187,IF(E187=F187,H187,I187)))","v":""},{"$f":"IF($K$4<>0,HLOOKUP($K$4,$O$4:$XFD187,ROW()-3,FALSE),\"\")","v":""},{"$f":"IF($K$4<>0,HLOOKUP(CONCATENATE($K$4,\"1\"),$O$4:$XFD187,ROW()-3,FALSE),\"\")","v":""},{"$f":"IF($K$4<>0,HLOOKUP(CONCATENATE($K$4,\"2\"),$O$4:$XFD187,ROW()-3,FALSE),\"\")","v":""},{"$nulls":3},{"$f":"IF(OR($E187=\"\",$F187=\"\",O187=\"\",P187=\"\"),\"\",IF(AND(O187=$E187,P187=$F187),Reglement!$S$3*$J187,IF(SIGN($E187-$F187)=SIGN(O187-P187),Reglement!$S$4*$J187,0))*IF(AND($E187+$F187>=6,O187+P187>=6),Reglement!$S$29,IF(AND($E187+$F187>=4,O187+P187>=4),Reglement!$S$28,1)))","v":""}]
[null,null,{"$f":"Score!F243","v":"Chelsea"},{"$f":"Score!I243","v":"Southampton"},{"$f":"IF(Score!G243<>\"\",Score!G243,\"\")","v":""},{"$f":"IF(Score!H243<>\"\",Score!H243,\"\")","v":""},1,1,1,"",{"$f":"IF($K$4<>0,HLOOKUP($K$4,$O$4:$XFD188,ROW()-3,FALSE),\"\")","v":""},{"$f":"IF($K$4<>0,HLOOKUP(CONCATENATE($K$4,\"1\"),$O$4:$XFD188,ROW()-3,FALSE),\"\")","v":""},{"$f":"IF($K$4<>0,HLOOKUP(CONCATENATE($K$4,\"2\"),$O$4:$XFD188,ROW()-3,FALSE),\"\")","v":""},{"$nulls":3},{"$f":"IF(OR($E188=\"\",$F188=\"\",O188=\"\",P188=\"\"),\"\",IF(AND(O188=$E188,P188=$F188),Reglement!$S$3*$J188,IF(SIGN($E188-$F188)=SIGN(O188-P188),Reglement!$S$4*$J188,0))*IF(AND($E188+$F188>=6,O188+P188>=6),Reglement!$S$29,IF(AND($E188+$F188>=4,O188+P188>=4),Reglement!$S$28,1)))","v":""}]
[null,null,{"$f":"Score!F244","v":"Crystal Palace"},{"$f":"Score!I244","v":"West Ham"},{"$f":"IF(Score!G244<>\"\",Score!G244,\"\")","v":""},{"$f":"IF(Score!H244<>\"\",Score!H244,\"\")","v":""},1,1,1,"",{"$f":"IF($K$4<>0,HLOOKUP($K$4,$O$4:$XFD189,ROW()-3,FALSE),\"\")","v":""},{"$f":"IF($K$4<>0,HLOOKUP(CONCATENATE($K$4,\"1\"),$O$4:$XFD189,ROW()-3,FALSE),\"\")","v":""},{"$f":"IF($K$4<>0,HLOOKUP(CONCATENATE($K$4,\"2\"),$O$4:$XFD189,ROW()-3,FALSE),\"\")","v":""},{"$nulls":3},{"$f":"IF(OR($E189=\"\",$F189=\"\",O189=\"\",P189=\"\"),\"\",IF(AND(O189=$E189,P189=$F189),Reglement!$S$3*$J189,IF(SIGN($E189-$F189)=SIGN(O189-P189),Reglement!$S$4*$J189,0))*IF(AND($E189+$F189>=6,O189+P189>=6),Reglement!$S$29,IF(AND($E189+$F189>=4,O189+P189>=4),Reglement!$S$28,1)))","v":""}]
[null,null,{"$f":"Score!F245","v":"Everton"},{"$f":"Score!I245","v":"Burnley"},{"$f":"IF(Score!G245<>\"\",Score!G245,\"\")","v":""},{"$f":"IF(Score!H245<>\"\",Score!H245,\"\")","v":""},1,1,1,"",{"$f":"IF($K$4<>0,HLOOKUP($K$4,$O$4:$XFD190,ROW()-3,FALSE),\"\")","v":""},{"$f":"IF($K$4<>0,HLOOKUP(CONCATENATE($K$4,\"1\"),$O$4:$XFD190,ROW()-3,FALSE),\"\")","v":""},{"$f":"IF($K$4<>0,HLOOKUP(CONCATENATE($K$4,\"2\"),$O$4:$XFD190,ROW()-3,FALSE),\"\")","v":""},{"$nulls":3},{"$f":"IF(OR($E190=\"\",$F190=\"\",O190=\"\",P190=\"\"),\"\",IF(AND(O190=$E190,P190=$F190),Reglement!$S$3*$J190,IF(SIGN($E190-$F190)=SIGN(O190-P190),Reglement!$S$4*$J190,0))*IF(AND($E190+$F190>=6,O190+P190>=6),Reglement!$S$29,IF(AND($E190+$F190>=4,O190+P190>=4),Reglement!$S$28,1)))","v":""}]
[null,null,{"$f":"Score!F246","v":"Leicester City"},{"$f":"Score!I246","v":"Liverpool"},{"$f":"IF(Score!G246<>\"\",Score!G246,\"\")","v":""},{"$f":"IF(Score!H246<>\"\",Score!H246,\"\")","v":""},1,1,1,"",{"$f":"IF($K$4<>0,HLOOKUP($K$4,$O$4:$XFD191,ROW()-3,FALSE),\"\")","v":""},{"$f":"IF($K$4<>0,HLOOKUP(CONCATENATE($K$4,\"1\"),$O$4:$XFD191,ROW()-3,FALSE),\"\")","v":""},{"$f":"IF($K$4<>0,HLOOKUP(CONCATENATE($K$4,\"2\"),$O$4:$XFD191,ROW()-3,FALSE),\"\")","v":""},{"$nulls":3},{"$f":"IF(OR($E191=\"\",$F191=\"\",O191=\"\",P191=\"\"),\"\",IF(AND(O191=$E191,P191=$F191),Reglement!$S$3*$J191,IF(SIGN($E191-$F191)=SIGN(O191-P191),Reglement!$S$4*$J191,0))*IF(AND($E191+$F191>=6,O191+P191>=6),Reglement!$S$29,IF(AND($E191+$F191>=4,O191+P191>=4),Reglement!$S$28,1)))","v":""}]
[null,null,{"$f":"Score!F247","v":"Manchester United"},{"$f":"Score!I247","v":"Newcastle"},{"$f":"IF(Score!G247<>\"\",Score!G247,\"\")","v":""},{"$f":"IF(Score!H247<>\"\",Score!H247,\"\")","v":""},1,1,1,"",{"$f":"IF($K$4<>0,HLOOKUP($K$4,$O$4:$XFD192,ROW()-3,FALSE),\"\")","v":""},{"$f":"IF($K$4<>0,HLOOKUP(CONCATENATE($K$4,\"1\"),$O$4:$XFD192,ROW()-3,FALSE),\"\")","v":""},{"$f":"IF($K$4<>0,HLOOKUP(CONCATENATE($K$4,\"2\"),$O$4:$XFD192,ROW()-3,FALSE),\"\")","v":""},{"$nulls":3},{"$f":"IF(OR($E192=\"\",$F192=\"\",O192=\"\",P192=\"\"),\"\",IF(AND(O192=$E192,P192=$F192),Reglement!$S$3*$J192,IF(SIGN($E192-$F192)=SIGN(O192-P192),Reglement!$S$4*$J192,0))*IF(AND($E192+$F192>=6,O192+P192>=6),Reglement!$S$29,IF(AND($E192+$F192>=4,O192+P192>=4),Reglement!$S$28,1)))","v":""}]
[null,null,{"$f":"Score!F248","v":"Sheffield United"},{"$f":"Score!I248","v":"Watford"},{"$f":"IF(Score!G248<>\"\",Score!G248,\"\")","v":""},{"$f":"IF(Score!H248<>\"\",Score!H248,\"\")","v":""},1,1,1,{"$f":"IF(OR(E193=\"\",F193=\"\"),\"\",IF(E193>F193,G193,IF(E193=F193,H193,I193)))","v":""},{"$f":"IF($K$4<>0,HLOOKUP($K$4,$O$4:$XFD193,ROW()-3,FALSE),\"\")","v":""},{"$f":"IF($K$4<>0,HLOOKUP(CONCATENATE($K$4,\"1\"),$O$4:$XFD193,ROW()-3,FALSE),\"\")","v":""},{"$f":"IF($K$4<>0,HLOOKUP(CONCATENATE($K$4,\"2\"),$O$4:$XFD193,ROW()-3,FALSE),\"\")","v":""},{"$nulls":3},{"$f":"IF(OR($E193=\"\",$F193=\"\",O193=\"\",P193=\"\"),\"\",IF(AND(O193=$E193,P193=$F193),Reglement!$S$3*$J193,IF(SIGN($E193-$F193)=SIGN(O193-P193),Reglement!$S$4*$J193,0))*IF(AND($E193+$F193>=6,O193+P193>=6),Reglement!$S$29,IF(AND($E193+$F193>=4,O193+P193>=4),Reglement!$S$28,1)))","v":""}]
[null,null,{"$f":"Score!F249","v":"Tottenham"},{"$f":"Score!I249","v":"Brighton"},{"$f":"IF(Score!G249<>\"\",Score!G249,\"\")","v":""},{"$f":"IF(Score!H249<>\"\",Score!H249,\"\")","v":""},1,1,1,"",{"$f":"IF($K$4<>0,HLOOKUP($K$4,$O$4:$XFD194,ROW()-3,FALSE),\"\")","v":""},{"$f":"IF($K$4<>0,HLOOKUP(CONCATENATE($K$4,\"1\"),$O$4:$XFD194,ROW()-3,FALSE),\"\")","v":""},{"$f":"IF($K$4<>0,HLOOKUP(CONCATENATE($K$4,\"2\"),$O$4:$XFD194,ROW()-3,FALSE),\"\")","v":""},{"$nulls":3},{"$f":"IF(OR($E194=\"\",$F194=\"\",O194=\"\",P194=\"\"),\"\",IF(AND(O194=$E194,P194=$F194),Reglement!$S$3*$J194,IF(SIGN($E194-$F194)=SIGN(O194-P194),Reglement!$S$4*$J194,0))*IF(AND($E194+$F194>=6,O194+P194>=6),Reglement!$S$29,IF(AND($E194+$F194>=4,O194+P194>=4),Reglement!$S$28,1)))","v":""}]
[null,null,{"$f":"Score!F250","v":"Wolverhampton"},{"$f":"Score!I250","v":"Manchester City"},{"$f":"IF(Score!G250<>\"\",Score!G250,\"\")","v":""},{"$f":"IF(Score!H250<>\"\",Score!H250,\"\")","v":""},1,1,1,"",{"$f":"IF($K$4<>0,HLOOKUP($K$4,$O$4:$XFD195,ROW()-3,FALSE),\"\")","v":""},{"$f":"IF($K$4<>0,HLOOKUP(CONCATENATE($K$4,\"1\"),$O$4:$XFD195,ROW()-3,FALSE),\"\")","v":""},{"$f":"IF($K$4<>0,HLOOKUP(CONCATENATE($K$4,\"2\"),$O$4:$XFD195,ROW()-3,FALSE),\"\")","v":""},{"$nulls":3},{"$f":"IF(OR($E195=\"\",$F195=\"\",O195=\"\",P195=\"\"),\"\",IF(AND(O195=$E195,P195=$F195),Reglement!$S$3*$J195,IF(SIGN($E195-$F195)=SIGN(O195-P195),Reglement!$S$4*$J195,0))*IF(AND($E195+$F195>=6,O195+P195>=6),Reglement!$S$29,IF(AND($E195+$F195>=4,O195+P195>=4),Reglement!$S$28,1)))","v":""}]
["JOURNEE n°20",null,{"$f":"Score!T7","v":"Arsenal"},{"$f":"Score!W7","v":"Chelsea"},{"$f":"IF(Score!U7<>\"\",Score!U7,\"\")","v":""},{"$f":"IF(Score!V7<>\"\",Score!V7,\"\")","v":""},1,1,1,"",{"$f":"IF($K$4<>0,HLOOKUP($K$4,$O$4:$XFD196,ROW()-3,FALSE),\"\")","v":""},{"$f":"IF($K$4<>0,HLOOKUP(CONCATENATE($K$4,\"1\"),$O$4:$XFD196,ROW()-3,FALSE),\"\")","v":""},{"$f":"IF($K$4<>0,HLOOKUP(CONCATENATE($K$4,\"2\"),$O$4:$XFD196,ROW()-3,FALSE),\"\")","v":""},{"$nulls":3},{"$f":"IF(OR($E196=\"\",$F196=\"\",O196=\"\",P196=\"\"),\"\",IF(AND(O196=$E196,P196=$F196),Reglement!$S$3*$J196,IF(SIGN($E196-$F196)=SIGN(O196-P196),Reglement!$S$4*$J196,0))*IF(AND($E196+$F196>=6,O196+P196>=6),Reglement!$S$29,IF(AND($E196+$F196>=4,O196+P196>=4),Reglement!$S$28,1)))","v":""}]
[null,null,{"$f":"Score!T8","v":"Brighton"},{"$f":"Score!W8","v":"Bournemouth"},{"$f":"IF(Score!U8<>\"\",Score!U8,\"\")","v":""},{"$f":"IF(Score!V8<>\"\",Score!V8,\"\")","v":""},1,1,1,"",{"$f":"IF($K$4<>0,HLOOKUP($K$4,$O$4:$XFD197,ROW()-3,FALSE),\"\")","v":""},{"$f":"IF($K$4<>0,HLOOKUP(CONCATENATE($K$4,\"1\"),$O$4:$XFD197,ROW()-3,FALSE),\"\")","v":""},{"$f":"IF($K$4<>0,HLOOKUP(CONCATENATE($K$4,\"2\"),$O$4:$XFD197,ROW()-3,FALSE),\"\")","v":""},{"$nulls":3},{"$f":"IF(OR($E197=\"\",$F197=\"\",O197=\"\",P197=\"\"),\"\",IF(AND(O197=$E197,P197=$F197),Reglement!$S$3*$J197,IF(SIGN($E197-$F197)=SIGN(O197-P197),Reglement!$S$4*$J197,0))*IF(AND($E197+$F197>=6,O197+P197>=6),Reglement!$S$29,IF(AND($E197+$F197>=4,O197+P197>=4),Reglement!$S$28,1)))","v":""}]
[null,null,{"$f":"Score!T9","v":"Burnley"},{"$f":"Score!W9","v":"Manchester United"},{"$f":"IF(Score!U9<>\"\",Score!U9,\"\")","v":""},{"$f":"IF(Score!V9<>\"\",Score!V9,\"\")","v":""},1,1,1,"",{"$f":"IF($K$4<>0,HLOOKUP($K$4,$O$4:$XFD198,ROW()-3,FALSE),\"\")","v":""},{"$f":"IF($K$4<>0,HLOOKUP(CONCATENATE($K$4,\"1\"),$O$4:$XFD198,ROW()-3,FALSE),\"\")","v":""},{"$f":"IF($K$4<>0,HLOOKUP(CONCATENATE($K$4,\"2\"),$O$4:$XFD198,ROW()-3,FALSE),\"\")","v":""},{"$nulls":3},{"$f":"IF(OR($E198=\"\",$F198=\"\",O198=\"\",P198=\"\"),\"\",IF(AND(O198=$E198,P198=$F198),Reglement!$S$3*$J198,IF(SIGN($E198-$F198)=SIGN(O198-P198),Reglement!$S$4*$J198,0))*IF(AND($E198+$F198>=6,O198+P198>=6),Reglement!$S$29,IF(AND($E198+$F198>=4,O198+P198>=4),Reglement!$S$28,1)))","v":""}]
[null,null,{"$f":"Score!T10","v":"Liverpool"},{"$f":"Score!W10","v":"Wolverhampton"},{"$f":"IF(Score!U10<>\"\",Score!U10,\"\")","v":""},{"$f":"IF(Score!V10<>\"\",Score!V10,\"\")","v":""},1,1,1,"",{"$f":"IF($K$4<>0,HLOOKUP($K$4,$O$4:$XFD199,ROW()-3,FALSE),\"\")","v":""},{"$f":"IF($K$4<>0,HLOOKUP(CONCATENATE($K$4,\"1\"),$O$4:$XFD199,ROW()-3,FALSE),\"\")","v":""},{"$f":"IF($K$4<>0,HLOOKUP(CONCATENATE($K$4,\"2\"),$O$4:$XFD199,ROW()-3,FALSE),\"\")","v":""},{"$nulls":3},{"$f":"IF(OR($E199=\"\",$F199=\"\",O199=\"\",P199=\"\"),\"\",IF(AND(O199=$E199,P199=$F199),Reglement!$S$3*$J199,IF(SIGN($E199-$F199)=SIGN(O199-P199),Reglement!$S$4*$J199,0))*IF(AND($E199+$F199>=6,O199+P199>=6),Reglement!$S$29,IF(AND($E199+$F199>=4,O199+P199>=4),Reglement!$S$28,1)))","v":""}]
[null,null,{"$f":"Score!T11","v":"Manchester City"},{"$f":"Score!W11","v":"Sheffield United"},{"$f":"IF(Score!U11<>\"\",Score!U11,\"\")","v":""},{"$f":"IF(Score!V11<>\"\",Score!V11,\"\")","v":""},1,1,1,"",{"$f":"IF($K$4<>0,HLOOKUP($K$4,$O$4:$XFD200,ROW()-3,FALSE),\"\")","v":""},{"$f":"IF($K$4<>0,HLOOKUP(CONCATENATE($K$4,\"1\"),$O$4:$XFD200,ROW()-3,FALSE),\"\")","v":""},{"$f":"IF($K$4<>0,HLOOKUP(CONCATENATE($K$4,\"2\"),$O$4:$XFD200,ROW()-3,FALSE),\"\")","v":""},{"$nulls":3},{"$f":"IF(OR($E200=\"\",$F200=\"\",O200=\"\",P200=\"\"),\"\",IF(AND(O200=$E200,P200=$F200),Reglement!$S$3*$J200,IF(SIGN($E200-$F200)=SIGN(O200-P200),Reglement!$S$4*$J200,0))*IF(AND($E200+$F200>=6,O200+P200>=6),Reglement!$S$29,IF(AND($E200+$F200>=4,O200+P200>=4),Reglement!$S$28,1)))","v":""}]
[null,null,{"$f":"Score!T12","v":"Newcastle"},{"$f":"Score!W12","v":"Everton"},{"$f":"IF(Score!U12<>\"\",Score!U12,\"\")","v":""},{"$f":"IF(Score!V12<>\"\",Score!V12,\"\")","v":""},1,1,1,"",{"$f":"IF($K$4<>0,HLOOKUP($K$4,$O$4:$XFD201,ROW()-3,FALSE),\"\")","v":""},{"$f":"IF($K$4<>0,HLOOKUP(CONCATENATE($K$4,\"1\"),$O$4:$XFD201,ROW()-3,FALSE),\"\")","v":""},{"$f":"IF($K$4<>0,HLOOKUP(CONCATENATE($K$4,\"2\"),$O$4:$XFD201,ROW()-3,FALSE),\"\")","v":""},{"$nulls":3},{"$f":"IF(OR($E201=\"\",$F201=\"\",O201=\"\",P201=\"\"),\"\",IF(AND(O201=$E201,P201=$F201),Reglement!$S$3*$J201,IF(SIGN($E201-$F201)=SIGN(O201-P201),Reglement!$S$4*$J201,0))*IF(AND($E201+$F201>=6,O201+P201>=6),Reglement!$S$29,IF(AND($E201+$F201>=4,O201+P201>=4),Reglement!$S$28,1)))","v":""}]
[null,null,{"$f":"Score!T13","v":"Norwich"},{"$f":"Score!W13","v":"Tottenham"},{"$f":"IF(Score!U13<>\"\",Score!U13,\"\")","v":""},{"$f":"IF(Score!V13<>\"\",Score!V13,\"\")","v":""},1,1,1,"",{"$f":"IF($K$4<>0,HLOOKUP($K$4,$O$4:$XFD202,ROW()-3,FALSE),\"\")","v":""},{"$f":"IF($K$4<>0,HLOOKUP(CONCATENATE($K$4,\"1\"),$O$4:$XFD202,ROW()-3,FALSE),\"\")","v":""},{"$f":"IF($K$4<>0,HLOOKUP(CONCATENATE($K$4,\"2\"),$O$4:$XFD202,ROW()-3,FALSE),\"\")","v":""},{"$nulls":3},{"$f":"IF(OR($E202=\"\",$F202=\"\",O202=\"\",P202=\"\"),\"\",IF(AND(O202=$E202,P202=$F202),Reglement!$S$3*$J202,IF(SIGN($E202-$F202)=SIGN(O202-P202),Reglement!$S$4*$J202,0))*IF(AND($E202+$F202>=6,O202+P202>=6),Reglement!$S$29,IF(AND($E202+$F202>=4,O202+P202>=4),Reglement!$S$28,1)))","v":""}]
[null,null,{"$f":"Score!T14","v":"Southampton"},{"$f":"Score!W14","v":"Crystal Palace"},{"$f":"IF(Score!U14<>\"\",Score!U14,\"\")","v":""},{"$f":"IF(Score!V14<>\"\",Score!V14,\"\")","v":""},1,1,1,"",{"$f":"IF($K$4<>0,HLOOKUP($K$4,$O$4:$XFD203,ROW()-3,FALSE),\"\")","v":""},{"$f":"IF($K$4<>0,HLOOKUP(CONCATENATE($K$4,\"1\"),$O$4:$XFD203,ROW()-3,FALSE),\"\")","v":""},{"$f":"IF($K$4<>0,HLOOKUP(CONCATENATE($K$4,\"2\"),$O$4:$XFD203,ROW()-3,FALSE),\"\")","v":""},{"$nulls":3},{"$f":"IF(OR($E203=\"\",$F203=\"\",O203=\"\",P203=\"\"),\"\",IF(AND(O203=$E203,P203=$F203),Reglement!$S$3*$J203,IF(SIGN($E203-$F203)=SIGN(O203-P203),Reglement!$S$4*$J203,0))*IF(AND($E203+$F203>=6,O203+P203>=6),Reglement!$S$29,IF(AND($E203+$F203>=4,O203+P203>=4),Reglement!$S$28,1)))","v":""}]
[null,null,{"$f":"Score!T15","v":"Watford"},{"$f":"Score!W15","v":"Aston Villa"},{"$f":"IF(Score!U15<>\"\",Score!U15,\"\")","v":""},{"$f":"IF(Score!V15<>\"\",Score!V15,\"\")","v":""},1,1,1,"",{"$f":"IF($K$4<>0,HLOOKUP($K$4,$O$4:$XFD204,ROW()-3,FALSE),\"\")","v":""},{"$f":"IF($K$4<>0,HLOOKUP(CONCATENATE($K$4,\"1\"),$O$4:$XFD204,ROW()-3,FALSE),\"\")","v":""},{"$f":"IF($K$4<>0,HLOOKUP(CONCATENATE($K$4,\"2\"),$O$4:$XFD204,ROW()-3,FALSE),\"\")","v":""},{"$nulls":3},{"$f":"IF(OR($E204=\"\",$F204=\"\",O204=\"\",P204=\"\"),\"\",IF(AND(O204=$E204,P204=$F204),Reglement!$S$3*$J204,IF(SIGN($E204-$F204)=SIGN(O204-P204),Reglement!$S$4*$J204,0))*IF(AND($E204+$F204>=6,O204+P204>=6),Reglement!$S$29,IF(AND($E204+$F204>=4,O204+P204>=4),Reglement!$S$28,1)))","v":""}]
[null,null,{"$f":"Score!T16","v":"West Ham"},{"$f":"Score!W16","v":"Leicester City"},{"$f":"IF(Score!U16<>\"\",Score!U16,\"\")","v":""},{"$f":"IF(Score!V16<>\"\",Score!V16,\"\")","v":""},1,1,1,"",{"$f":"IF($K$4<>0,HLOOKUP($K$4,$O$4:$XFD205,ROW()-3,FALSE),\"\")","v":""},{"$f":"IF($K$4<>0,HLOOKUP(CONCATENATE($K$4,\"1\"),$O$4:$XFD205,ROW()-3,FALSE),\"\")","v":""},{"$f":"IF($K$4<>0,HLOOKUP(CONCATENATE($K$4,\"2\"),$O$4:$XFD205,ROW()-3,FALSE),\"\")","v":""},{"$nulls":3},{"$f":"IF(OR($E205=\"\",$F205=\"\",O205=\"\",P205=\"\"),\"\",IF(AND(O205=$E205,P205=$F205),Reglement!$S$3*$J205,IF(SIGN($E205-$F205)=SIGN(O205-P205),Reglement!$S$4*$J205,0))*IF(AND($E205+$F205>=6,O205+P205>=6),Reglement!$S$29,IF(AND($E205+$F205>=4,O205+P205>=4),Reglement!$S$28,1)))","v":""}]
["JOURNEE n°21",null,{"$f":"Score!T20","v":"Arsenal"},{"$f":"Score!W20","v":"Manchester United"},{"$f":"IF(Score!U20<>\"\",Score!U20,\"\")","v":""},{"$f":"IF(Score!V20<>\"\",Score!V20,\"\")","v":""},1,1,1,"",{"$f":"IF($K$4<>0,HLOOKUP($K$4,$O$4:$XFD206,ROW()-3,FALSE),\"\")","v":""},{"$f":"IF($K$4<>0,HLOOKUP(CONCATENATE($K$4,\"1\"),$O$4:$XFD206,ROW()-3,FALSE),\"\")","v":""},{"$f":"IF($K$4<>0,HLOOKUP(CONCATENATE($K$4,\"2\"),$O$4:$XFD206,ROW()-3,FALSE),\"\")","v":""},{"$nulls":3},{"$f":"IF(OR($E206=\"\",$F206=\"\",O206=\"\",P206=\"\"),\"\",IF(AND(O206=$E206,P206=$F206),Reglement!$S$3*$J206,IF(SIGN($E206-$F206)=SIGN(O206-P206),Reglement!$S$4*$J206,0))*IF(AND($E206+$F206>=6,O206+P206>=6),Reglement!$S$29,IF(AND($E206+$F206>=4,O206+P206>=4),Reglement!$S$28,1)))","v":""}]
[null,null,{"$f":"Score!T21","v":"Brighton"},{"$f":"Score!W21","v":"Chelsea"},{"$f":"IF(Score!U21<>\"\",Score!U21,\"\")","v":""},{"$f":"IF(Score!V21<>\"\",Score!V21,\"\")","v":""},1,1,1,"",{"$f":"IF($K$4<>0,HLOOKUP($K$4,$O$4:$XFD207,ROW()-3,FALSE),\"\")","v":""},{"$f":"IF($K$4<>0,HLOOKUP(CONCATENATE($K$4,\"1\"),$O$4:$XFD207,ROW()-3,FALSE),\"\")","v":""},{"$f":"IF($K$4<>0,HLOOKUP(CONCATENATE($K$4,\"2\"),$O$4:$XFD207,ROW()-3,FALSE),\"\")","v":""},{"$nulls":3},{"$f":"IF(OR($E207=\"\",$F207=\"\",O207=\"\",P207=\"\"),\"\",IF(AND(O207=$E207,P207=$F207),Reglement!$S$3*$J207,IF(SIGN($E207-$F207)=SIGN(O207-P207),Reglement!$S$4*$J207,0))*IF(AND($E207+$F207>=6,O207+P207>=6),Reglement!$S$29,IF(AND($E207+$F207>=4,O207+P207>=4),Reglement!$S$28,1)))","v":""}]
[null,null,{"$f":"Score!T22","v":"Burnley"},{"$f":"Score!W22","v":"Aston Villa"},{"$f":"IF(Score!U22<>\"\",Score!U22,\"\")","v":""},{"$f":"IF(Score!V22<>\"\",Score!V22,\"\")","v":""},1,1,1,"",{"$f":"IF($K$4<>0,HLOOKUP($K$4,$O$4:$XFD208,ROW()-3,FALSE),\"\")","v":""},{"$f":"IF($K$4<>0,HLOOKUP(CONCATENATE($K$4,\"1\"),$O$4:$XFD208,ROW()-3,FALSE),\"\")","v":""},{"$f":"IF($K$4<>0,HLOOKUP(CONCATENATE($K$4,\"2\"),$O$4:$XFD208,ROW()-3,FALSE),\"\")","v":""},{"$nulls":3},{"$f":"IF(OR($E208=\"\",$F208=\"\",O208=\"\",P208=\"\"),\"\",IF(AND(O208=$E208,P208=$F208),Reglement!$S$3*$J208,IF(SIGN($E208-$F208)=SIGN(O208-P208),Reglement!$S$4*$J208,0))*IF(AND($E208+$F208>=6,O208+P208>=6),Reglement!$S$29,IF(AND($E208+$F208>=4,O208+P208>=4),Reglement!$S$28,1)))","v":""}]
[null,null,{"$f":"Score!T23","v":"Liverpool"},{"$f":"Score!W23","v":"Sheffield United"},{"$f":"IF(Score!U23<>\"\",Score!U23,\"\")","v":""},{"$f":"IF(Score!V23<>\"\",Score!V23,\"\")","v":""},1,1,1,"",{"$f":"IF($K$4<>0,HLOOKUP($K$4,$O$4:$XFD209,ROW()-3,FALSE),\"\")","v":""},{"$f":"IF($K$4<>0,HLOOKUP(CONCATENATE($K$4,\"1\"),$O$4:$XFD209,ROW()-3,FALSE),\"\")","v":""},{"$f":"IF($K$4<>0,HLOOKUP(CONCATENATE($K$4,\"2\"),$O$4:$XFD209,ROW()-3,FALSE),\"\")","v":""},{"$nulls":3},{"$f":"IF(OR($E209=\"\",$F209=\"\",O209=\"\",P209=\"\"),\"\",IF(AND(O209=$E209,P209=$F209),Reglement!$S$3*$J209,IF(SIGN($E209-$F209)=SIGN(O209-P209),Reglement!$S$4*$J209,0))*IF(AND($E209+$F209>=6,O209+P209>=6),Reglement!$S$29,IF(AND($E209+$F209>=4,O209+P209>=4),Reglement!$S$28,1)))","v":""}]
[null,null,{"$f":"Score!T24","v":"Manchester City"},{"$f":"Score!W24","v":"Everton"},{"$f":"IF(Score!U24<>\"\",Score!U24,\"\")","v":""},{"$f":"IF(Score!V24<>\"\",Score!V24,\"\")","v":""},1,1,1,"",{"$f":"IF($K$4<>0,HLOOKUP($K$4,$O$4:$XFD210,ROW()-3,FALSE),\"\")","v":""},{"$f":"IF($K$4<>0,HLOOKUP(CONCATENATE($K$4,\"1\"),$O$4:$XFD210,ROW()-3,FALSE),\"\")","v":""},{"$f":"IF($K$4<>0,HLOOKUP(CONCATENATE($K$4,\"2\"),$O$4:$XFD210,ROW()-3,FALSE),\"\")","v":""},{"$nulls":3},{"$f":"IF(OR($E210=\"\",$F210=\"\",O210=\"\",P210=\"\"),\"\",IF(AND(O210=$E210,P210=$F210),Reglement!$S$3*$J210,IF(SIGN($E210-$F210)=SIGN(O210-P210),Reglement!$S$4*$J210,0))*IF(AND($E210+$F210>=6,O210+P210>=6),Reglement!$S$29,IF(AND($E210+$F210>=4,O210+P210>=4),Reglement!$S$28,1)))","v":""}]
[null,null,{"$f":"Score!T25","v":"Newcastle"},{"$f":"Score!W25","v":"Leicester City"},{"$f":"IF(Score!U25<>\"\",Score!U25,\"\")","v":""},{"$f":"IF(Score!V25<>\"\",Score!V25,\"\")","v":""},1,1,1,{"$f":"IF(OR(E211=\"\",F211=\"\"),\"\",IF(E211>F211,G211,IF(E211=F211,H211,I211)))","v":""},{"$f":"IF($K$4<>0,HLOOKUP($K$4,$O$4:$XFD211,ROW()-3,FALSE),\"\")","v":""},{"$f":"IF($K$4<>0,HLOOKUP(CONCATENATE($K$4,\"1\"),$O$4:$XFD211,ROW()-3,FALSE),\"\")","v":""},{"$f":"IF($K$4<>0,HLOOKUP(CONCATENATE($K$4,\"2\"),$O$4:$XFD211,ROW()-3,FALSE),\"\")","v":""},{"$nulls":3},{"$f":"IF(OR($E211=\"\",$F211=\"\",O211=\"\",P211=\"\"),\"\",IF(AND(O211=$E211,P211=$F211),Reglement!$S$3*$J211,IF(SIGN($E211-$F211)=SIGN(O211-P211),Reglement!$S$4*$J211,0))*IF(AND($E211+$F211>=6,O211+P211>=6),Reglement!$S$29,IF(AND($E211+$F211>=4,O211+P211>=4),Reglement!$S$28,1)))","v":""}]
[null,null,{"$f":"Score!T26","v":"Norwich"},{"$f":"Score!W26","v":"Crystal Palace"},{"$f":"IF(Score!U26<>\"\",Score!U26,\"\")","v":""},{"$f":"IF(Score!V26<>\"\",Score!V26,\"\")","v":""},1,1,1,"",{"$f":"IF($K$4<>0,HLOOKUP($K$4,$O$4:$XFD212,ROW()-3,FALSE),\"\")","v":""},{"$f":"IF($K$4<>0,HLOOKUP(CONCATENATE($K$4,\"1\"),$O$4:$XFD212,ROW()-3,FALSE),\"\")","v":""},{"$f":"IF($K$4<>0,HLOOKUP(CONCATENATE($K$4,\"2\"),$O$4:$XFD212,ROW()-3,FALSE),\"\")","v":""},{"$nulls":3},{"$f":"IF(OR($E212=\"\",$F212=\"\",O212=\"\",P212=\"\"),\"\",IF(AND(O212=$E212,P212=$F212),Reglement!$S$3*$J212,IF(SIGN($E212-$F212)=SIGN(O212-P212),Reglement!$S$4*$J212,0))*IF(AND($E212+$F212>=6,O212+P212>=6),Reglement!$S$29,IF(AND($E212+$F212>=4,O212+P212>=4),Reglement!$S$28,1)))","v":""}]
[null,null,{"$f":"Score!T27","v":"Southampton"},{"$f":"Score!W27","v":"Tottenham"},{"$f":"IF(Score!U27<>\"\",Score!U27,\"\")","v":""},{"$f":"IF(Score!V27<>\"\",Score!V27,\"\")","v":""},1,1,1,"",{"$f":"IF($K$4<>0,HLOOKUP($K$4,$O$4:$XFD213,ROW()-3,FALSE),\"\")","v":""},{"$f":"IF($K$4<>0,HLOOKUP(CONCATENATE($K$4,\"1\"),$O$4:$XFD213,ROW()-3,FALSE),\"\")","v":""},{"$f":"IF($K$4<>0,HLOOKUP(CONCATENATE($K$4,\"2\"),$O$4:$XFD213,ROW()-3,FALSE),\"\")","v":""},{"$nulls":3},{"$f":"IF(OR($E213=\"\",$F213=\"\",O213=\"\",P213=\"\"),\"\",IF(AND(O213=$E213,P213=$F213),Reglement!$S$3*$J213,IF(SIGN($E213-$F213)=SIGN(O213-P213),Reglement!$S$4*$J213,0))*IF(AND($E213+$F213>=6,O213+P213>=6),Reglement!$S$29,IF(AND($E213+$F213>=4,O213+P213>=4),Reglement!$S$28,1)))","v":""}]
[null,null,{"$f":"Score!T28","v":"Watford"},{"$f":"Score!W28","v":"Wolverhampton"},{"$f":"IF(Score!U28<>\"\",Score!U28,\"\")","v":""},{"$f":"IF(Score!V28<>\"\",Score!V28,\"\")","v":""},1,1,1,"",{"$f":"IF($K$4<>0,HLOOKUP($K$4,$O$4:$XFD214,ROW()-3,FALSE),\"\")","v":""},{"$f":"IF($K$4<>0,HLOOKUP(CONCATENATE($K$4,\"1\"),$O$4:$XFD214,ROW()-3,FALSE),\"\")","v":""},{"$f":"IF($K$4<>0,HLOOKUP(CONCATENATE($K$4,\"2\"),$O$4:$XFD214,ROW()-3,FALSE),\"\")","v":""},{"$nulls":3},{"$f":"IF(OR($E214=\"\",$F214=\"\",O214=\"\",P214=\"\"),\"\",IF(AND(O214=$E214,P214=$F214),Reglement!$S$3*$J214,IF(SIGN($E214-$F214)=SIGN(O214-P214),Reglement!$S$4*$J214,0))*IF(AND($E214+$F214>=6,O214+P214>=6),Reglement!$S$29,IF(AND($E214+$F214>=4,O214+P214>=4),Reglement!$S$28,1)))","v":""}]
[null,null,{"$f":"Score!T29","v":"West Ham"},{"$f":"Score!W29","v":"Bournemouth"},{"$f":"IF(Score!U29<>\"\",Score!U29,\"\")","v":""},{"$f":"IF(Score!V29<>\"\",Score!V29,\"\")","v":""},1,1,1,"",{"$f":"IF($K$4<>0,HLOOKUP($K$4,$O$4:$XFD215,ROW()-3,FALSE),\"\")","v":""},{"$f":"IF($K$4<>0,HLOOKUP(CONCATENATE($K$4,\"1\"),$O$4:$XFD215,ROW()-3,FALSE),\"\")","v":""},{"$f":"IF($K$4<>0,HLOOKUP(CONCATENATE($K$4,\"2\"),$O$4:$XFD215,ROW()-3,FALSE),\"\")","v":""},{"$nulls":3},{"$f":"IF(OR($E215=\"\",$F215=\"\",O215=\"\",P215=\"\"),\"\",IF(AND(O215=$E215,P215=$F215),Reglement!$S$3*$J215,IF(SIGN($E215-$F215)=SIGN(O215-P215),Reglement!$S$4*$J215,0))*IF(AND($E215+$F215>=6,O215+P215>=6),Reglement!$S$29,IF(AND($E215+$F215>=4,O215+P215>=4),Reglement!$S$28,1)))","v":""}]
["JOURNEE n°22",null,{"$f":"Score!T33","v":"Bournemouth"},{"$f":"Score!W33","v":"Watford"},{"$f":"IF(Score!U33<>\"\",Score!U33,\"\")","v":""},{"$f":"IF(Score!V33<>\"\",Score!V33,\"\")","v":""},1,1,1,"",{"$f":"IF($K$4<>0,HLOOKUP($K$4,$O$4:$XFD216,ROW()-3,FALSE),\"\")","v":""},{"$f":"IF($K$4<>0,HLOOKUP(CONCATENATE($K$4,\"1\"),$O$4:$XFD216,ROW()-3,FALSE),\"\")","v":""},{"$f":"IF($K$4<>0,HLOOKUP(CONCATENATE($K$4,\"2\"),$O$4:$XFD216,ROW()-3,FALSE),\"\")","v":""},{"$nulls":3},{"$f":"IF(OR($E216=\"\",$F216=\"\",O216=\"\",P216=\"\"),\"\",IF(AND(O216=$E216,P216=$F216),Reglement!$S$3*$J216,IF(SIGN($E216-$F216)=SIGN(O216-P216),Reglement!$S$4*$J216,0))*IF(AND($E216+$F216>=6,O216+P216>=6),Reglement!$S$29,IF(AND($E216+$F216>=4,O216+P216>=4),Reglement!$S$28,1)))","v":""}]
[null,null,{"$f":"Score!T34","v":"Aston Villa"},{"$f":"Score!W34","v":"Manchester City"},{"$f":"IF(Score!U34<>\"\",Score!U34,\"\")","v":""},{"$f":"IF(Score!V34<>\"\",Score!V34,\"\")","v":""},1,1,1,"",{"$f":"IF($K$4<>0,HLOOKUP($K$4,$O$4:$XFD217,ROW()-3,FALSE),\"\")","v":""},{"$f":"IF($K$4<>0,HLOOKUP(CONCATENATE($K$4,\"1\"),$O$4:$XFD217,ROW()-3,FALSE),\"\")","v":""},{"$f":"IF($K$4<>0,HLOOKUP(CONCATENATE($K$4,\"2\"),$O$4:$XFD217,ROW()-3,FALSE),\"\")","v":""},{"$nulls":3},{"$f":"IF(OR($E217=\"\",$F217=\"\",O217=\"\",P217=\"\"),\"\",IF(AND(O217=$E217,P217=$F217),Reglement!$S$3*$J217,IF(SIGN($E217-$F217)=SIGN(O217-P217),Reglement!$S$4*$J217,0))*IF(AND($E217+$F217>=6,O217+P217>=6),Reglement!$S$29,IF(AND($E217+$F217>=4,O217+P217>=4),Reglement!$S$28,1)))","v":""}]
[null,null,{"$f":"Score!T35","v":"Chelsea"},{"$f":"Score!W35","v":"Burnley"},{"$f":"IF(Score!U35<>\"\",Score!U35,\"\")","v":""},{"$f":"IF(Score!V35<>\"\",Score!V35,\"\")","v":""},1,1,1,"",{"$f":"IF($K$4<>0,HLOOKUP($K$4,$O$4:$XFD218,ROW()-3,FALSE),\"\")","v":""},{"$f":"IF($K$4<>0,HLOOKUP(CONCATENATE($K$4,\"1\"),$O$4:$XFD218,ROW()-3,FALSE),\"\")","v":""},{"$f":"IF($K$4<>0,HLOOKUP(CONCATENATE($K$4,\"2\"),$O$4:$XFD218,ROW()-3,FALSE),\"\")","v":""},{"$nulls":3},{"$f":"IF(OR($E218=\"\",$F218=\"\",O218=\"\",P218=\"\"),\"\",IF(AND(O218=$E218,P218=$F218),Reglement!$S$3*$J218,IF(SIGN($E218-$F218)=SIGN(O218-P218),Reglement!$S$4*$J218,0))*IF(AND($E218+$F218>=6,O218+P218>=6),Reglement!$S$29,IF(AND($E218+$F218>=4,O218+P218>=4),Reglement!$S$28,1)))","v":""}]
[null,null,{"$f":"Score!T36","v":"Crystal Palace"},{"$f":"Score!W36","v":"Arsenal"},{"$f":"IF(Score!U36<>\"\",Score!U36,\"\")","v":""},{"$f":"IF(Score!V36<>\"\",Score!V36,\"\")","v":""},1,1,1,"",{"$f":"IF($K$4<>0,HLOOKUP($K$4,$O$4:$XFD219,ROW()-3,FALSE),\"\")","v":""},{"$f":"IF($K$4<>0,HLOOKUP(CONCATENATE($K$4,\"1\"),$O$4:$XFD219,ROW()-3,FALSE),\"\")","v":""},{"$f":"IF($K$4<>0,HLOOKUP(CONCATENATE($K$4,\"2\"),$O$4:$XFD219,ROW()-3,FALSE),\"\")","v":""},{"$nulls":3},{"$f":"IF(OR($E219=\"\",$F219=\"\",O219=\"\",P219=\"\"),\"\",IF(AND(O219=$E219,P219=$F219),Reglement!$S$3*$J219,IF(SIGN($E219-$F219)=SIGN(O219-P219),Reglement!$S$4*$J219,0))*IF(AND($E219+$F219>=6,O219+P219>=6),Reglement!$S$29,IF(AND($E219+$F219>=4,O219+P219>=4),Reglement!$S$28,1)))","v":""}]
[null,null,{"$f":"Score!T37","v":"Everton"},{"$f":"Score!W37","v":"Brighton"},{"$f":"IF(Score!U37<>\"\",Score!U37,\"\")","v":""},{"$f":"IF(Score!V37<>\"\",Score!V37,\"\")","v":""},1,1,1,{"$f":"IF(OR(E220=\"\",F220=\"\"),\"\",IF(E220>F220,G220,IF(E220=F220,H220,I220)))","v":""},{"$f":"IF($K$4<>0,HLOOKUP($K$4,$O$4:$XFD220,ROW()-3,FALSE),\"\")","v":""},{"$f":"IF($K$4<>0,HLOOKUP(CONCATENATE($K$4,\"1\"),$O$4:$XFD220,ROW()-3,FALSE),\"\")","v":""},{"$f":"IF($K$4<>0,HLOOKUP(CONCATENATE($K$4,\"2\"),$O$4:$XFD220,ROW()-3,FALSE),\"\")","v":""},{"$nulls":3},{"$f":"IF(OR($E220=\"\",$F220=\"\",O220=\"\",P220=\"\"),\"\",IF(AND(O220=$E220,P220=$F220),Reglement!$S$3*$J220,IF(SIGN($E220-$F220)=SIGN(O220-P220),Reglement!$S$4*$J220,0))*IF(AND($E220+$F220>=6,O220+P220>=6),Reglement!$S$29,IF(AND($E220+$F220>=4,O220+P220>=4),Reglement!$S$28,1)))","v":""}]
[null,null,{"$f":"Score!T38","v":"Leicester City"},{"$f":"Score!W38","v":"Southampton"},{"$f":"IF(Score!U38<>\"\",Score!U38,\"\")","v":""},{"$f":"IF(Score!V38<>\"\",Score!V38,\"\")","v":""},1,1,1,"",{"$f":"IF($K$4<>0,HLOOKUP($K$4,$O$4:$XFD221,ROW()-3,FALSE),\"\")","v":""},{"$f":"IF($K$4<>0,HLOOKUP(CONCATENATE($K$4,\"1\"),$O$4:$XFD221,ROW()-3,FALSE),\"\")","v":""},{"$f":"IF($K$4<>0,HLOOKUP(CONCATENATE($K$4,\"2\"),$O$4:$XFD221,ROW()-3,FALSE),\"\")","v":""},{"$nulls":3},{"$f":"IF(OR($E221=\"\",$F221=\"\",O221=\"\",P221=\"\"),\"\",IF(AND(O221=$E221,P221=$F221),Reglement!$S$3*$J221,IF(SIGN($E221-$F221)=SIGN(O221-P221),Reglement!$S$4*$J221,0))*IF(AND($E221+$F221>=6,O221+P221>=6),Reglement!$S$29,IF(AND($E221+$F221>=4,O221+P221>=4),Reglement!$S$28,1)))","v":""}]
[null,null,{"$f":"Score!T39","v":"Manchester United"},{"$f":"Score!W39","v":"Norwich"},{"$f":"IF(Score!U39<>\"\",Score!U39,\"\")","v":""},{"$f":"IF(Score!V39<>\"\",Score!V39,\"\")","v":""},1,1,1,"",{"$f":"IF($K$4<>0,HLOOKUP($K$4,$O$4:$XFD222,ROW()-3,FALSE),\"\")","v":""},{"$f":"IF($K$4<>0,HLOOKUP(CONCATENATE($K$4,\"1\"),$O$4:$XFD222,ROW()-3,FALSE),\"\")","v":""},{"$f":"IF($K$4<>0,HLOOKUP(CONCATENATE($K$4,\"2\"),$O$4:$XFD222,ROW()-3,FALSE),\"\")","v":""},{"$nulls":3},{"$f":"IF(OR($E222=\"\",$F222=\"\",O222=\"\",P222=\"\"),\"\",IF(AND(O222=$E222,P222=$F222),Reglement!$S$3*$J222,IF(SIGN($E222-$F222)=SIGN(O222-P222),Reglement!$S$4*$J222,0))*IF(AND($E222+$F222>=6,O222+P222>=6),Reglement!$S$29,IF(AND($E222+$F222>=4,O222+P222>=4),Reglement!$S$28,1)))","v":""}]
[null,null,{"$f":"Score!T40","v":"Sheffield United"},{"$f":"Score!W40","v":"West Ham"},{"$f":"IF(Score!U40<>\"\",Score!U40,\"\")","v":""},{"$f":"IF(Score!V40<>\"\",Score!V40,\"\")","v":""},1,1,1,"",{"$f":"IF($K$4<>0,HLOOKUP($K$4,$O$4:$XFD223,ROW()-3,FALSE),\"\")","v":""},{"$f":"IF($K$4<>0,HLOOKUP(CONCATENATE($K$4,\"1\"),$O$4:$XFD223,ROW()-3,FALSE),\"\")","v":""},{"$f":"IF($K$4<>0,HLOOKUP(CONCATENATE($K$4,\"2\"),$O$4:$XFD223,ROW()-3,FALSE),\"\")","v":""},{"$nulls":3},{"$f":"IF(OR($E223=\"\",$F223=\"\",O223=\"\",P223=\"\"),\"\",IF(AND(O223=$E223,P223=$F223),Reglement!$S$3*$J223,IF(SIGN($E223-$F223)=SIGN(O223-P223),Reglement!$S$4*$J223,0))*IF(AND($E223+$F223>=6,O223+P223>=6),Reglement!$S$29,IF(AND($E223+$F223>=4,O223+P223>=4),Reglement!$S$28,1)))","v":""}]
[null,null,{"$f":"Score!T41","v":"Tottenham"},{"$f":"Score!W41","v":"Liverpool"},{"$f":"IF(Score!U41<>\"\",Score!U41,\"\")","v":""},{"$f":"IF(Score!V41<>\"\",Score!V41,\"\")","v":""},1,1,1,"",{"$f":"IF($K$4<>0,HLOOKUP($K$4,$O$4:$XFD224,ROW()-3,FALSE),\"\")","v":""},{"$f":"IF($K$4<>0,HLOOKUP(CONCATENATE($K$4,\"1\"),$O$4:$XFD224,ROW()-3,FALSE),\"\")","v":""},{"$f":"IF($K$4<>0,HLOOKUP(CONCATENATE($K$4,\"2\"),$O$4:$XFD224,ROW()-3,FALSE),\"\")","v":""},{"$nulls":3},{"$f":"IF(OR($E224=\"\",$F224=\"\",O224=\"\",P224=\"\"),\"\",IF(AND(O224=$E224,P224=$F224),Reglement!$S$3*$J224,IF(SIGN($E224-$F224)=SIGN(O224-P224),Reglement!$S$4*$J224,0))*IF(AND($E224+$F224>=6,O224+P224>=6),Reglement!$S$29,IF(AND($E224+$F224>=4,O224+P224>=4),Reglement!$S$28,1)))","v":""}]
[null,null,{"$f":"Score!T42","v":"Wolverhampton"},{"$f":"Score!W42","v":"Newcastle"},{"$f":"IF(Score!U42<>\"\",Score!U42,\"\")","v":""},{"$f":"IF(Score!V42<>\"\",Score!V42,\"\")","v":""},1,1,1,"",{"$f":"IF($K$4<>0,HLOOKUP($K$4,$O$4:$XFD225,ROW()-3,FALSE),\"\")","v":""},{"$f":"IF($K$4<>0,HLOOKUP(CONCATENATE($K$4,\"1\"),$O$4:$XFD225,ROW()-3,FALSE),\"\")","v":""},{"$f":"IF($K$4<>0,HLOOKUP(CONCATENATE($K$4,\"2\"),$O$4:$XFD225,ROW()-3,FALSE),\"\")","v":""},{"$nulls":3},{"$f":"IF(OR($E225=\"\",$F225=\"\",O225=\"\",P225=\"\"),\"\",IF(AND(O225=$E225,P225=$F225),Reglement!$S$3*$J225,IF(SIGN($E225-$F225)=SIGN(O225-P225),Reglement!$S$4*$J225,0))*IF(AND($E225+$F225>=6,O225+P225>=6),Reglement!$S$29,IF(AND($E225+$F225>=4,O225+P225>=4),Reglement!$S$28,1)))","v":""}]
["JOURNEE n°23",null,{"$f":"Score!T46","v":"Arsenal"},{"$f":"Score!W46","v":"Sheffield United"},{"$f":"IF(Score!U46<>\"\",Score!U46,\"\")","v":""},{"$f":"IF(Score!V46<>\"\",Score!V46,\"\")","v":""},1,1,1,"",{"$f":"IF($K$4<>0,HLOOKUP($K$4,$O$4:$XFD226,ROW()-3,FALSE),\"\")","v":""},{"$f":"IF($K$4<>0,HLOOKUP(CONCATENATE($K$4,\"1\"),$O$4:$XFD226,ROW()-3,FALSE),\"\")","v":""},{"$f":"IF($K$4<>0,HLOOKUP(CONCATENATE($K$4,\"2\"),$O$4:$XFD226,ROW()-3,FALSE),\"\")","v":""},{"$nulls":3},{"$f":"IF(OR($E226=\"\",$F226=\"\",O226=\"\",P226=\"\"),\"\",IF(AND(O226=$E226,P226=$F226),Reglement!$S$3*$J226,IF(SIGN($E226-$F226)=SIGN(O226-P226),Reglement!$S$4*$J226,0))*IF(AND($E226+$F226>=6,O226+P226>=6),Reglement!$S$29,IF(AND($E226+$F226>=4,O226+P226>=4),Reglement!$S$28,1)))","v":""}]
[null,null,{"$f":"Score!T47","v":"Brighton"},{"$f":"Score!W47","v":"Aston Villa"},{"$f":"IF(Score!U47<>\"\",Score!U47,\"\")","v":""},{"$f":"IF(Score!V47<>\"\",Score!V47,\"\")","v":""},1,1,1,"",{"$f":"IF($K$4<>0,HLOOKUP($K$4,$O$4:$XFD227,ROW()-3,FALSE),\"\")","v":""},{"$f":"IF($K$4<>0,HLOOKUP(CONCATENATE($K$4,\"1\"),$O$4:$XFD227,ROW()-3,FALSE),\"\")","v":""},{"$f":"IF($K$4<>0,HLOOKUP(CONCATENATE($K$4,\"2\"),$O$4:$XFD227,ROW()-3,FALSE),\"\")","v":""},{"$nulls":3},{"$f":"IF(OR($E227=\"\",$F227=\"\",O227=\"\",P227=\"\"),\"\",IF(AND(O227=$E227,P227=$F227),Reglement!$S$3*$J227,IF(SIGN($E227-$F227)=SIGN(O227-P227),Reglement!$S$4*$J227,0))*IF(AND($E227+$F227>=6,O227+P227>=6),Reglement!$S$29,IF(AND($E227+$F227>=4,O227+P227>=4),Reglement!$S$28,1)))","v":""}]
[null,null,{"$f":"Score!T48","v":"Burnley"},{"$f":"Score!W48","v":"Leicester City"},{"$f":"IF(Score!U48<>\"\",Score!U48,\"\")","v":""},{"$f":"IF(Score!V48<>\"\",Score!V48,\"\")","v":""},1,1,1,"",{"$f":"IF($K$4<>0,HLOOKUP($K$4,$O$4:$XFD228,ROW()-3,FALSE),\"\")","v":""},{"$f":"IF($K$4<>0,HLOOKUP(CONCATENATE($K$4,\"1\"),$O$4:$XFD228,ROW()-3,FALSE),\"\")","v":""},{"$f":"IF($K$4<>0,HLOOKUP(CONCATENATE($K$4,\"2\"),$O$4:$XFD228,ROW()-3,FALSE),\"\")","v":""},{"$nulls":3},{"$f":"IF(OR($E228=\"\",$F228=\"\",O228=\"\",P228=\"\"),\"\",IF(AND(O228=$E228,P228=$F228),Reglement!$S$3*$J228,IF(SIGN($E228-$F228)=SIGN(O228-P228),Reglement!$S$4*$J228,0))*IF(AND($E228+$F228>=6,O228+P228>=6),Reglement!$S$29,IF(AND($E228+$F228>=4,O228+P228>=4),Reglement!$S$28,1)))","v":""}]
[null,null,{"$f":"Score!T49","v":"Liverpool"},{"$f":"Score!W49","v":"Manchester United"},{"$f":"IF(Score!U49<>\"\",Score!U49,\"\")","v":""},{"$f":"IF(Score!V49<>\"\",Score!V49,\"\")","v":""},1,1,1,"",{"$f":"IF($K$4<>0,HLOOKUP($K$4,$O$4:$XFD229,ROW()-3,FALSE),\"\")","v":""},{"$f":"IF($K$4<>0,HLOOKUP(CONCATENATE($K$4,\"1\"),$O$4:$XFD229,ROW()-3,FALSE),\"\")","v":""},{"$f":"IF($K$4<>0,HLOOKUP(CONCATENATE($K$4,\"2\"),$O$4:$XFD229,ROW()-3,FALSE),\"\")","v":""},{"$nulls":3},{"$f":"IF(OR($E229=\"\",$F229=\"\",O229=\"\",P229=\"\"),\"\",IF(AND(O229=$E229,P229=$F229),Reglement!$S$3*$J229,IF(SIGN($E229-$F229)=SIGN(O229-P229),Reglement!$S$4*$J229,0))*IF(AND($E229+$F229>=6,O229+P229>=6),Reglement!$S$29,IF(AND($E229+$F229>=4,O229+P229>=4),Reglement!$S$28,1)))","v":""}]
[null,null,{"$f":"Score!T50","v":"Manchester City"},{"$f":"Score!W50","v":"Crystal Palace"},{"$f":"IF(Score!U50<>\"\",Score!U50,\"\")","v":""},{"$f":"IF(Score!V50<>\"\",Score!V50,\"\")","v":""},1,1,1,"",{"$f":"IF($K$4<>0,HLOOKUP($K$4,$O$4:$XFD230,ROW()-3,FALSE),\"\")","v":""},{"$f":"IF($K$4<>0,HLOOKUP(CONCATENATE($K$4,\"1\"),$O$4:$XFD230,ROW()-3,FALSE),\"\")","v":""},{"$f":"IF($K$4<>0,HLOOKUP(CONCATENATE($K$4,\"2\"),$O$4:$XFD230,ROW()-3,FALSE),\"\")","v":""},{"$nulls":3},{"$f":"IF(OR($E230=\"\",$F230=\"\",O230=\"\",P230=\"\"),\"\",IF(AND(O230=$E230,P230=$F230),Reglement!$S$3*$J230,IF(SIGN($E230-$F230)=SIGN(O230-P230),Reglement!$S$4*$J230,0))*IF(AND($E230+$F230>=6,O230+P230>=6),Reglement!$S$29,IF(AND($E230+$F230>=4,O230+P230>=4),Reglement!$S$28,1)))","v":""}]
[null,null,{"$f":"Score!T51","v":"Newcastle"},{"$f":"Score!W51","v":"Chelsea"},{"$f":"IF(Score!U51<>\"\",Score!U51,\"\")","v":""},{"$f":"IF(Score!V51<>\"\",Score!V51,\"\")","v":""},1,1,1,"",{"$f":"IF($K$4<>0,HLOOKUP($K$4,$O$4:$XFD231,ROW()-3,FALSE),\"\")","v":""},{"$f":"IF($K$4<>0,HLOOKUP(CONCATENATE($K$4,\"1\"),$O$4:$XFD231,ROW()-3,FALSE),\"\")","v":""},{"$f":"IF($K$4<>0,HLOOKUP(CONCATENATE($K$4,\"2\"),$O$4:$XFD231,ROW()-3,FALSE),\"\")","v":""},{"$nulls":3},{"$f":"IF(OR($E231=\"\",$F231=\"\",O231=\"\",P231=\"\"),\"\",IF(AND(O231=$E231,P231=$F231),Reglement!$S$3*$J231,IF(SIGN($E231-$F231)=SIGN(O231-P231),Reglement!$S$4*$J231,0))*IF(AND($E231+$F231>=6,O231+P231>=6),Reglement!$S$29,IF(AND($E231+$F231>=4,O231+P231>=4),Reglement!$S$28,1)))","v":""}]
[null,null,{"$f":"Score!T52","v":"Norwich"},{"$f":"Score!W52","v":"Bournemouth"},{"$f":"IF(Score!U52<>\"\",Score!U52,\"\")","v":""},{"$f":"IF(Score!V52<>\"\",Score!V52,\"\")","v":""},1,1,1,"",{"$f":"IF($K$4<>0,HLOOKUP($K$4,$O$4:$XFD232,ROW()-3,FALSE),\"\")","v":""},{"$f":"IF($K$4<>0,HLOOKUP(CONCATENATE($K$4,\"1\"),$O$4:$XFD232,ROW()-3,FALSE),\"\")","v":""},{"$f":"IF($K$4<>0,HLOOKUP(CONCATENATE($K$4,\"2\"),$O$4:$XFD232,ROW()-3,FALSE),\"\")","v":""},{"$nulls":3},{"$f":"IF(OR($E232=\"\",$F232=\"\",O232=\"\",P232=\"\"),\"\",IF(AND(O232=$E232,P232=$F232),Reglement!$S$3*$J232,IF(SIGN($E232-$F232)=SIGN(O232-P232),Reglement!$S$4*$J232,0))*IF(AND($E232+$F232>=6,O232+P232>=6),Reglement!$S$29,IF(AND($E232+$F232>=4,O232+P232>=4),Reglement!$S$28,1)))","v":""}]
[null,null,{"$f":"Score!T53","v":"Southampton"},{"$f":"Score!W53","v":"Wolverhampton"},{"$f":"IF(Score!U53<>\"\",Score!U53,\"\")","v":""},{"$f":"IF(Score!V53<>\"\",Score!V53,\"\")","v":""},1,1,1,"",{"$f":"IF($K$4<>0,HLOOKUP($K$4,$O$4:$XFD233,ROW()-3,FALSE),\"\")","v":""},{"$f":"IF($K$4<>0,HLOOKUP(CONCATENATE($K$4,\"1\"),$O$4:$XFD233,ROW()-3,FALSE),\"\")","v":""},{"$f":"IF($K$4<>0,HLOOKUP(CONCATENATE($K$4,\"2\"),$O$4:$XFD233,ROW()-3,FALSE),\"\")","v":""},{"$nulls":3},{"$f":"IF(OR($E233=\"\",$F233=\"\",O233=\"\",P233=\"\"),\"\",IF(AND(O233=$E233,P233=$F233),Reglement!$S$3*$J233,IF(SIGN($E233-$F233)=SIGN(O233-P233),Reglement!$S$4*$J233,0))*IF(AND($E233+$F233>=6,O233+P233>=6),Reglement!$S$29,IF(AND($E233+$F233>=4,O233+P233>=4),Reglement!$S$28,1)))","v":""}]
[null,null,{"$f":"Score!T54","v":"Watford"},{"$f":"Score!W54","v":"Tottenham"},{"$f":"IF(Score!U54<>\"\",Score!U54,\"\")","v":""},{"$f":"IF(Score!V54<>\"\",Score!V54,\"\")","v":""},1,1,1,"",{"$f":"IF($K$4<>0,HLOOKUP($K$4,$O$4:$XFD234,ROW()-3,FALSE),\"\")","v":""},{"$f":"IF($K$4<>0,HLOOKUP(CONCATENATE($K$4,\"1\"),$O$4:$XFD234,ROW()-3,FALSE),\"\")","v":""},{"$f":"IF($K$4<>0,HLOOKUP(CONCATENATE($K$4,\"2\"),$O$4:$XFD234,ROW()-3,FALSE),\"\")","v":""},{"$nulls":3},{"$f":"IF(OR($E234=\"\",$F234=\"\",O234=\"\",P234=\"\"),\"\",IF(AND(O234=$E234,P234=$F234),Reglement!$S$3*$J234,IF(SIGN($E234-$F234)=SIGN(O234-P234),Reglement!$S$4*$J234,0))*IF(AND($E234+$F234>=6,O234+P234>=6),Reglement!$S$29,IF(AND($E234+$F234>=4,O234+P234>=4),Reglement!$S$28,1)))","v":""}]
[null,null,{"$f":"Score!T55","v":"West Ham"},{"$f":"Score!W55","v":"Everton"},{"$f":"IF(Score!U55<>\"\",Score!U55,\"\")","v":""},{"$f":"IF(Score!V55<>\"\",Score!V55,\"\")","v":""},1,1,1,"",{"$f":"IF($K$4<>0,HLOOKUP($K$4,$O$4:$XFD235,ROW()-3,FALSE),\"\")","v":""},{"$f":"IF($K$4<>0,HLOOKUP(CONCATENATE($K$4,\"1\"),$O$4:$XFD235,ROW()-3,FALSE),\"\")","v":""},{"$f":"IF($K$4<>0,HLOOKUP(CONCATENATE($K$4,\"2\"),$O$4:$XFD235,ROW()-3,FALSE),\"\")","v":""},{"$nulls":3},{"$f":"IF(OR($E235=\"\",$F235=\"\",O235=\"\",P235=\"\"),\"\",IF(AND(O235=$E235,P235=$F235),Reglement!$S$3*$J235,IF(SIGN($E235-$F235)=SIGN(O235-P235),Reglement!$S$4*$J235,0))*IF(AND($E235+$F235>=6,O235+P235>=6),Reglement!$S$29,IF(AND($E235+$F235>=4,O235+P235>=4),Reglement!$S$28,1)))","v":""}]
["JOURNEE n°24",null,{"$f":"Score!T59","v":"Bournemouth"},{"$f":"Score!W59","v":"Brighton"},{"$f":"IF(Score!U59<>\"\",Score!U59,\"\")","v":""},{"$f":"IF(Score!V59<>\"\",Score!V59,\"\")","v":""},1,1,1,"",{"$f":"IF($K$4<>0,HLOOKUP($K$4,$O$4:$XFD236,ROW()-3,FALSE),\"\")","v":""},{"$f":"IF($K$4<>0,HLOOKUP(CONCATENATE($K$4,\"1\"),$O$4:$XFD236,ROW()-3,FALSE),\"\")","v":""},{"$f":"IF($K$4<>0,HLOOKUP(CONCATENATE($K$4,\"2\"),$O$4:$XFD236,ROW()-3,FALSE),\"\")","v":""},{"$nulls":3},{"$f":"IF(OR($E236=\"\",$F236=\"\",O236=\"\",P236=\"\"),\"\",IF(AND(O236=$E236,P236=$F236),Reglement!$S$3*$J236,IF(SIGN($E236-$F236)=SIGN(O236-P236),Reglement!$S$4*$J236,0))*IF(AND($E236+$F236>=6,O236+P236>=6),Reglement!$S$29,IF(AND($E236+$F236>=4,O236+P236>=4),Reglement!$S$28,1)))","v":""}]
[null,null,{"$f":"Score!T60","v":"Aston Villa"},{"$f":"Score!W60","v":"Watford"},{"$f":"IF(Score!U60<>\"\",Score!U60,\"\")","v":""},{"$f":"IF(Score!V60<>\"\",Score!V60,\"\")","v":""},1,1,1,"",{"$f":"IF($K$4<>0,HLOOKUP($K$4,$O$4:$XFD237,ROW()-3,FALSE),\"\")","v":""},{"$f":"IF($K$4<>0,HLOOKUP(CONCATENATE($K$4,\"1\"),$O$4:$XFD237,ROW()-3,FALSE),\"\")","v":""},{"$f":"IF($K$4<>0,HLOOKUP(CONCATENATE($K$4,\"2\"),$O$4:$XFD237,ROW()-3,FALSE),\"\")","v":""},{"$nulls":3},{"$f":"IF(OR($E237=\"\",$F237=\"\",O237=\"\",P237=\"\"),\"\",IF(AND(O237=$E237,P237=$F237),Reglement!$S$3*$J237,IF(SIGN($E237-$F237)=SIGN(O237-P237),Reglement!$S$4*$J237,0))*IF(AND($E237+$F237>=6,O237+P237>=6),Reglement!$S$29,IF(AND($E237+$F237>=4,O237+P237>=4),Reglement!$S$28,1)))","v":""}]
[null,null,{"$f":"Score!T61","v":"Everton"},{"$f":"Score!W61","v":"Newcastle"},{"$f":"IF(Score!U61<>\"\",Score!U61,\"\")","v":""},{"$f":"IF(Score!V61<>\"\",Score!V61,\"\")","v":""},1,1,1,"",{"$f":"IF($K$4<>0,HLOOKUP($K$4,$O$4:$XFD238,ROW()-3,FALSE),\"\")","v":""},{"$f":"IF($K$4<>0,HLOOKUP(CONCATENATE($K$4,\"1\"),$O$4:$XFD238,ROW()-3,FALSE),\"\")","v":""},{"$f":"IF($K$4<>0,HLOOKUP(CONCATENATE($K$4,\"2\"),$O$4:$XFD238,ROW()-3,FALSE),\"\")","v":""},{"$nulls":3},{"$f":"IF(OR($E238=\"\",$F238=\"\",O238=\"\",P238=\"\"),\"\",IF(AND(O238=$E238,P238=$F238),Reglement!$S$3*$J238,IF(SIGN($E238-$F238)=SIGN(O238-P238),Reglement!$S$4*$J238,0))*IF(AND($E238+$F238>=6,O238+P238>=6),Reglement!$S$29,IF(AND($E238+$F238>=4,O238+P238>=4),Reglement!$S$28,1)))","v":""}]
[null,null,{"$f":"Score!T62","v":"Leicester City"},{"$f":"Score!W62","v":"West Ham"},{"$f":"IF(Score!U62<>\"\",Score!U62,\"\")","v":""},{"$f":"IF(Score!V62<>\"\",Score!V62,\"\")","v":""},1,1,1,"",{"$f":"IF($K$4<>0,HLOOKUP($K$4,$O$4:$XFD239,ROW()-3,FALSE),\"\")","v":""},{"$f":"IF($K$4<>0,HLOOKUP(CONCATENATE($K$4,\"1\"),$O$4:$XFD239,ROW()-3,FALSE),\"\")","v":""},{"$f":"IF($K$4<>0,HLOOKUP(CONCATENATE($K$4,\"2\"),$O$4:$XFD239,ROW()-3,FALSE),\"\")","v":""},{"$nulls":3},{"$f":"IF(OR($E239=\"\",$F239=\"\",O239=\"\",P239=\"\"),\"\",IF(AND(O239=$E239,P239=$F239),Reglement!$S$3*$J239,IF(SIGN($E239-$F239)=SIGN(O239-P239),Reglement!$S$4*$J239,0))*IF(AND($E239+$F239>=6,O239+P239>=6),Reglement!$S$29,IF(AND($E239+$F239>=4,O239+P239>=4),Reglement!$S$28,1)))","v":""}]
[null,null,{"$f":"Score!T63","v":"Sheffield United"},{"$f":"Score!W63","v":"Manchester City"},{"$f":"IF(Score!U63<>\"\",Score!U63,\"\")","v":""},{"$f":"IF(Score!V63<>\"\",Score!V63,\"\")","v":""},1,1,1,"",{"$f":"IF($K$4<>0,HLOOKUP($K$4,$O$4:$XFD240,ROW()-3,FALSE),\"\")","v":""},{"$f":"IF($K$4<>0,HLOOKUP(CONCATENATE($K$4,\"1\"),$O$4:$XFD240,ROW()-3,FALSE),\"\")","v":""},{"$f":"IF($K$4<>0,HLOOKUP(CONCATENATE($K$4,\"2\"),$O$4:$XFD240,ROW()-3,FALSE),\"\")","v":""},{"$nulls":3},{"$f":"IF(OR($E240=\"\",$F240=\"\",O240=\"\",P240=\"\"),\"\",IF(AND(O240=$E240,P240=$F240),Reglement!$S$3*$J240,IF(SIGN($E240-$F240)=SIGN(O240-P240),Reglement!$S$4*$J240,0))*IF(AND($E240+$F240>=6,O240+P240>=6),Reglement!$S$29,IF(AND($E240+$F240>=4,O240+P240>=4),Reglement!$S$28,1)))","v":""}]
[null,null,{"$f":"Score!T64","v":"Wolverhampton"},{"$f":"Score!W64","v":"Liverpool"},{"$f":"IF(Score!U64<>\"\",Score!U64,\"\")","v":""},{"$f":"IF(Score!V64<>\"\",Score!V64,\"\")","v":""},1,1,1,"",{"$f":"IF($K$4<>0,HLOOKUP($K$4,$O$4:$XFD241,ROW()-3,FALSE),\"\")","v":""},{"$f":"IF($K$4<>0,HLOOKUP(CONCATENATE($K$4,\"1\"),$O$4:$XFD241,ROW()-3,FALSE),\"\")","v":""},{"$f":"IF($K$4<>0,HLOOKUP(CONCATENATE($K$4,\"2\"),$O$4:$XFD241,ROW()-3,FALSE),\"\")","v":""},{"$nulls":3},{"$f":"IF(OR($E241=\"\",$F241=\"\",O241=\"\",P241=\"\"),\"\",IF(AND(O241=$E241,P241=$F241),Reglement!$S$3*$J241,IF(SIGN($E241-$F241)=SIGN(O241-P241),Reglement!$S$4*$J241,0))*IF(AND($E241+$F241>=6,O241+P241>=6),Reglement!$S$29,IF(AND($E241+$F241>=4,O241+P241>=4),Reglement!$S$28,1)))","v":""}]
[null,null,{"$f":"Score!T65","v":"Manchester United"},{"$f":"Score!W65","v":"Burnley"},{"$f":"IF(Score!U65<>\"\",Score!U65,\"\")","v":""},{"$f":"IF(Score!V65<>\"\",Score!V65,\"\")","v":""},1,1,1,"",{"$f":"IF($K$4<>0,HLOOKUP($K$4,$O$4:$XFD242,ROW()-3,FALSE),\"\")","v":""},{"$f":"IF($K$4<>0,HLOOKUP(CONCATENATE($K$4,\"1\"),$O$4:$XFD242,ROW()-3,FALSE),\"\")","v":""},{"$f":"IF($K$4<>0,HLOOKUP(CONCATENATE($K$4,\"2\"),$O$4:$XFD242,ROW()-3,FALSE),\"\")","v":""},{"$nulls":3},{"$f":"IF(OR($E242=\"\",$F242=\"\",O242=\"\",P242=\"\"),\"\",IF(AND(O242=$E242,P242=$F242),Reglement!$S$3*$J242,IF(SIGN($E242-$F242)=SIGN(O242-P242),Reglement!$S$4*$J242,0))*IF(AND($E242+$F242>=6,O242+P242>=6),Reglement!$S$29,IF(AND($E242+$F242>=4,O242+P242>=4),Reglement!$S$28,1)))","v":""}]
[null,null,{"$f":"Score!T66","v":"Chelsea"},{"$f":"Score!W66","v":"Arsenal"},{"$f":"IF(Score!U66<>\"\",Score!U66,\"\")","v":""},{"$f":"IF(Score!V66<>\"\",Score!V66,\"\")","v":""},1,1,1,"",{"$f":"IF($K$4<>0,HLOOKUP($K$4,$O$4:$XFD243,ROW()-3,FALSE),\"\")","v":""},{"$f":"IF($K$4<>0,HLOOKUP(CONCATENATE($K$4,\"1\"),$O$4:$XFD243,ROW()-3,FALSE),\"\")","v":""},{"$f":"IF($K$4<>0,HLOOKUP(CONCATENATE($K$4,\"2\"),$O$4:$XFD243,ROW()-3,FALSE),\"\")","v":""},{"$nulls":3},{"$f":"IF(OR($E243=\"\",$F243=\"\",O243=\"\",P243=\"\"),\"\",IF(AND(O243=$E243,P243=$F243),Reglement!$S$3*$J243,IF(SIGN($E243-$F243)=SIGN(O243-P243),Reglement!$S$4*$J243,0))*IF(AND($E243+$F243>=6,O243+P243>=6),Reglement!$S$29,IF(AND($E243+$F243>=4,O243+P243>=4),Reglement!$S$28,1)))","v":""}]
[null,null,{"$f":"Score!T67","v":"Tottenham"},{"$f":"Score!W67","v":"Norwich"},{"$f":"IF(Score!U67<>\"\",Score!U67,\"\")","v":""},{"$f":"IF(Score!V67<>\"\",Score!V67,\"\")","v":""},1,1,1,"",{"$f":"IF($K$4<>0,HLOOKUP($K$4,$O$4:$XFD244,ROW()-3,FALSE),\"\")","v":""},{"$f":"IF($K$4<>0,HLOOKUP(CONCATENATE($K$4,\"1\"),$O$4:$XFD244,ROW()-3,FALSE),\"\")","v":""},{"$f":"IF($K$4<>0,HLOOKUP(CONCATENATE($K$4,\"2\"),$O$4:$XFD244,ROW()-3,FALSE),\"\")","v":""},{"$nulls":3},{"$f":"IF(OR($E244=\"\",$F244=\"\",O244=\"\",P244=\"\"),\"\",IF(AND(O244=$E244,P244=$F244),Reglement!$S$3*$J244,IF(SIGN($E244-$F244)=SIGN(O244-P244),Reglement!$S$4*$J244,0))*IF(AND($E244+$F244>=6,O244+P244>=6),Reglement!$S$29,IF(AND($E244+$F244>=4,O244+P244>=4),Reglement!$S$28,1)))","v":""}]
[null,null,{"$f":"Score!T68","v":"Crystal Palace"},{"$f":"Score!W68","v":"Southampton"},{"$f":"IF(Score!U68<>\"\",Score!U68,\"\")","v":""},{"$f":"IF(Score!V68<>\"\",Score!V68,\"\")","v":""},1,1,1,"",{"$f":"IF($K$4<>0,HLOOKUP($K$4,$O$4:$XFD245,ROW()-3,FALSE),\"\")","v":""},{"$f":"IF($K$4<>0,HLOOKUP(CONCATENATE($K$4,\"1\"),$O$4:$XFD245,ROW()-3,FALSE),\"\")","v":""},{"$f":"IF($K$4<>0,HLOOKUP(CONCATENATE($K$4,\"2\"),$O$4:$XFD245,ROW()-3,FALSE),\"\")","v":""},{"$nulls":3},{"$f":"IF(OR($E245=\"\",$F245=\"\",O245=\"\",P245=\"\"),\"\",IF(AND(O245=$E245,P245=$F245),Reglement!$S$3*$J245,IF(SIGN($E245-$F245)=SIGN(O245-P245),Reglement!$S$4*$J245,0))*IF(AND($E245+$F245>=6,O245+P245>=6),Reglement!$S$29,IF(AND($E245+$F245>=4,O245+P245>=4),Reglement!$S$28,1)))","v":""}]
["JOURNEE n°25",null,{"$f":"Score!T72","v":"Bournemouth"},{"$f":"Score!W72","v":"Aston Villa"},{"$f":"IF(Score!U72<>\"\",Score!U72,\"\")","v":""},{"$f":"IF(Score!V72<>\"\",Score!V72,\"\")","v":""},1,1,1,"",{"$f":"IF($K$4<>0,HLOOKUP($K$4,$O$4:$XFD246,ROW()-3,FALSE),\"\")","v":""},{"$f":"IF($K$4<>0,HLOOKUP(CONCATENATE($K$4,\"1\"),$O$4:$XFD246,ROW()-3,FALSE),\"\")","v":""},{"$f":"IF($K$4<>0,HLOOKUP(CONCATENATE($K$4,\"2\"),$O$4:$XFD246,ROW()-3,FALSE),\"\")","v":""},{"$nulls":3},{"$f":"IF(OR($E246=\"\",$F246=\"\",O246=\"\",P246=\"\"),\"\",IF(AND(O246=$E246,P246=$F246),Reglement!$S$3*$J246,IF(SIGN($E246-$F246)=SIGN(O246-P246),Reglement!$S$4*$J246,0))*IF(AND($E246+$F246>=6,O246+P246>=6),Reglement!$S$29,IF(AND($E246+$F246>=4,O246+P246>=4),Reglement!$S$28,1)))","v":""}]
[null,null,{"$f":"Score!T73","v":"Burnley"},{"$f":"Score!W73","v":"Arsenal"},{"$f":"IF(Score!U73<>\"\",Score!U73,\"\")","v":""},{"$f":"IF(Score!V73<>\"\",Score!V73,\"\")","v":""},1,1,1,{"$f":"IF(OR(E247=\"\",F247=\"\"),\"\",IF(E247>F247,G247,IF(E247=F247,H247,I247)))","v":""},{"$f":"IF($K$4<>0,HLOOKUP($K$4,$O$4:$XFD247,ROW()-3,FALSE),\"\")","v":""},{"$f":"IF($K$4<>0,HLOOKUP(CONCATENATE($K$4,\"1\"),$O$4:$XFD247,ROW()-3,FALSE),\"\")","v":""},{"$f":"IF($K$4<>0,HLOOKUP(CONCATENATE($K$4,\"2\"),$O$4:$XFD247,ROW()-3,FALSE),\"\")","v":""},{"$nulls":3},{"$f":"IF(OR($E247=\"\",$F247=\"\",O247=\"\",P247=\"\"),\"\",IF(AND(O247=$E247,P247=$F247),Reglement!$S$3*$J247,IF(SIGN($E247-$F247)=SIGN(O247-P247),Reglement!$S$4*$J247,0))*IF(AND($E247+$F247>=6,O247+P247>=6),Reglement!$S$29,IF(AND($E247+$F247>=4,O247+P247>=4),Reglement!$S$28,1)))","v":""}]
[null,null,{"$f":"Score!T74","v":"Crystal Palace"},{"$f":"Score!W74","v":"Sheffield United"},{"$f":"IF(Score!U74<>\"\",Score!U74,\"\")","v":""},{"$f":"IF(Score!V74<>\"\",Score!V74,\"\")","v":""},1,1,1,"",{"$f":"IF($K$4<>0,HLOOKUP($K$4,$O$4:$XFD248,ROW()-3,FALSE),\"\")","v":""},{"$f":"IF($K$4<>0,HLOOKUP(CONCATENATE($K$4,\"1\"),$O$4:$XFD248,ROW()-3,FALSE),\"\")","v":""},{"$f":"IF($K$4<>0,HLOOKUP(CONCATENATE($K$4,\"2\"),$O$4:$XFD248,ROW()-3,FALSE),\"\")","v":""},{"$nulls":3},{"$f":"IF(OR($E248=\"\",$F248=\"\",O248=\"\",P248=\"\"),\"\",IF(AND(O248=$E248,P248=$F248),Reglement!$S$3*$J248,IF(SIGN($E248-$F248)=SIGN(O248-P248),Reglement!$S$4*$J248,0))*IF(AND($E248+$F248>=6,O248+P248>=6),Reglement!$S$29,IF(AND($E248+$F248>=4,O248+P248>=4),Reglement!$S$28,1)))","v":""}]
[null,null,{"$f":"Score!T75","v":"Leicester City"},{"$f":"Score!W75","v":"Chelsea"},{"$f":"IF(Score!U75<>\"\",Score!U75,\"\")","v":""},{"$f":"IF(Score!V75<>\"\",Score!V75,\"\")","v":""},1,1,1,"",{"$f":"IF($K$4<>0,HLOOKUP($K$4,$O$4:$XFD249,ROW()-3,FALSE),\"\")","v":""},{"$f":"IF($K$4<>0,HLOOKUP(CONCATENATE($K$4,\"1\"),$O$4:$XFD249,ROW()-3,FALSE),\"\")","v":""},{"$f":"IF($K$4<>0,HLOOKUP(CONCATENATE($K$4,\"2\"),$O$4:$XFD249,ROW()-3,FALSE),\"\")","v":""},{"$nulls":3},{"$f":"IF(OR($E249=\"\",$F249=\"\",O249=\"\",P249=\"\"),\"\",IF(AND(O249=$E249,P249=$F249),Reglement!$S$3*$J249,IF(SIGN($E249-$F249)=SIGN(O249-P249),Reglement!$S$4*$J249,0))*IF(AND($E249+$F249>=6,O249+P249>=6),Reglement!$S$29,IF(AND($E249+$F249>=4,O249+P249>=4),Reglement!$S$28,1)))","v":""}]
[null,null,{"$f":"Score!T76","v":"Liverpool"},{"$f":"Score!W76","v":"Southampton"},{"$f":"IF(Score!U76<>\"\",Score!U76,\"\")","v":""},{"$f":"IF(Score!V76<>\"\",Score!V76,\"\")","v":""},1,1,1,"",{"$f":"IF($K$4<>0,HLOOKUP($K$4,$O$4:$XFD250,ROW()-3,FALSE),\"\")","v":""},{"$f":"IF($K$4<>0,HLOOKUP(CONCATENATE($K$4,\"1\"),$O$4:$XFD250,ROW()-3,FALSE),\"\")","v":""},{"$f":"IF($K$4<>0,HLOOKUP(CONCATENATE($K$4,\"2\"),$O$4:$XFD250,ROW()-3,FALSE),\"\")","v":""},{"$nulls":3},{"$f":"IF(OR($E250=\"\",$F250=\"\",O250=\"\",P250=\"\"),\"\",IF(AND(O250=$E250,P250=$F250),Reglement!$S$3*$J250,IF(SIGN($E250-$F250)=SIGN(O250-P250),Reglement!$S$4*$J250,0))*IF(AND($E250+$F250>=6,O250+P250>=6),Reglement!$S$29,IF(AND($E250+$F250>=4,O250+P250>=4),Reglement!$S$28,1)))","v":""}]
[null,null,{"$f":"Score!T77","v":"Manchester United"},{"$f":"Score!W77","v":"Wolverhampton"},{"$f":"IF(Score!U77<>\"\",Score!U77,\"\")","v":""},{"$f":"IF(Score!V77<>\"\",Score!V77,\"\")","v":""},1,1,1,"",{"$f":"IF($K$4<>0,HLOOKUP($K$4,$O$4:$XFD251,ROW()-3,FALSE),\"\")","v":""},{"$f":"IF($K$4<>0,HLOOKUP(CONCATENATE($K$4,\"1\"),$O$4:$XFD251,ROW()-3,FALSE),\"\")","v":""},{"$f":"IF($K$4<>0,HLOOKUP(CONCATENATE($K$4,\"2\"),$O$4:$XFD251,ROW()-3,FALSE),\"\")","v":""},{"$nulls":3},{"$f":"IF(OR($E251=\"\",$F251=\"\",O251=\"\",P251=\"\"),\"\",IF(AND(O251=$E251,P251=$F251),Reglement!$S$3*$J251,IF(SIGN($E251-$F251)=SIGN(O251-P251),Reglement!$S$4*$J251,0))*IF(AND($E251+$F251>=6,O251+P251>=6),Reglement!$S$29,IF(AND($E251+$F251>=4,O251+P251>=4),Reglement!$S$28,1)))","v":""}]
[null,null,{"$f":"Score!T78","v":"Newcastle"},{"$f":"Score!W78","v":"Norwich"},{"$f":"IF(Score!U78<>\"\",Score!U78,\"\")","v":""},{"$f":"IF(Score!V78<>\"\",Score!V78,\"\")","v":""},1,1,1,"",{"$f":"IF($K$4<>0,HLOOKUP($K$4,$O$4:$XFD252,ROW()-3,FALSE),\"\")","v":""},{"$f":"IF($K$4<>0,HLOOKUP(CONCATENATE($K$4,\"1\"),$O$4:$XFD252,ROW()-3,FALSE),\"\")","v":""},{"$f":"IF($K$4<>0,HLOOKUP(CONCATENATE($K$4,\"2\"),$O$4:$XFD252,ROW()-3,FALSE),\"\")","v":""},{"$nulls":3},{"$f":"IF(OR($E252=\"\",$F252=\"\",O252=\"\",P252=\"\"),\"\",IF(AND(O252=$E252,P252=$F252),Reglement!$S$3*$J252,IF(SIGN($E252-$F252)=SIGN(O252-P252),Reglement!$S$4*$J252,0))*IF(AND($E252+$F252>=6,O252+P252>=6),Reglement!$S$29,IF(AND($E252+$F252>=4,O252+P252>=4),Reglement!$S$28,1)))","v":""}]
[null,null,{"$f":"Score!T79","v":"Tottenham"},{"$f":"Score!W79","v":"Manchester City"},{"$f":"IF(Score!U79<>\"\",Score!U79,\"\")","v":""},{"$f":"IF(Score!V79<>\"\",Score!V79,\"\")","v":""},1,1,1,{"$f":"IF(OR(E253=\"\",F253=\"\"),\"\",IF(E253>F253,G253,IF(E253=F253,H253,I253)))","v":""},{"$f":"IF($K$4<>0,HLOOKUP($K$4,$O$4:$XFD253,ROW()-3,FALSE),\"\")","v":""},{"$f":"IF($K$4<>0,HLOOKUP(CONCATENATE($K$4,\"1\"),$O$4:$XFD253,ROW()-3,FALSE),\"\")","v":""},{"$f":"IF($K$4<>0,HLOOKUP(CONCATENATE($K$4,\"2\"),$O$4:$XFD253,ROW()-3,FALSE),\"\")","v":""},{"$nulls":3},{"$f":"IF(OR($E253=\"\",$F253=\"\",O253=\"\",P253=\"\"),\"\",IF(AND(O253=$E253,P253=$F253),Reglement!$S$3*$J253,IF(SIGN($E253-$F253)=SIGN(O253-P253),Reglement!$S$4*$J253,0))*IF(AND($E253+$F253>=6,O253+P253>=6),Reglement!$S$29,IF(AND($E253+$F253>=4,O253+P253>=4),Reglement!$S$28,1)))","v":""}]
[null,null,{"$f":"Score!T80","v":"Watford"},{"$f":"Score!W80","v":"Everton"},{"$f":"IF(Score!U80<>\"\",Score!U80,\"\")","v":""},{"$f":"IF(Score!V80<>\"\",Score!V80,\"\")","v":""},1,1,1,"",{"$f":"IF($K$4<>0,HLOOKUP($K$4,$O$4:$XFD254,ROW()-3,FALSE),\"\")","v":""},{"$f":"IF($K$4<>0,HLOOKUP(CONCATENATE($K$4,\"1\"),$O$4:$XFD254,ROW()-3,FALSE),\"\")","v":""},{"$f":"IF($K$4<>0,HLOOKUP(CONCATENATE($K$4,\"2\"),$O$4:$XFD254,ROW()-3,FALSE),\"\")","v":""},{"$nulls":3},{"$f":"IF(OR($E254=\"\",$F254=\"\",O254=\"\",P254=\"\"),\"\",IF(AND(O254=$E254,P254=$F254),Reglement!$S$3*$J254,IF(SIGN($E254-$F254)=SIGN(O254-P254),Reglement!$S$4*$J254,0))*IF(AND($E254+$F254>=6,O254+P254>=6),Reglement!$S$29,IF(AND($E254+$F254>=4,O254+P254>=4),Reglement!$S$28,1)))","v":""}]
[null,null,{"$f":"Score!T81","v":"West Ham"},{"$f":"Score!W81","v":"Brighton"},{"$f":"IF(Score!U81<>\"\",Score!U81,\"\")","v":""},{"$f":"IF(Score!V81<>\"\",Score!V81,\"\")","v":""},1,1,1,"",{"$f":"IF($K$4<>0,HLOOKUP($K$4,$O$4:$XFD255,ROW()-3,FALSE),\"\")","v":""},{"$f":"IF($K$4<>0,HLOOKUP(CONCATENATE($K$4,\"1\"),$O$4:$XFD255,ROW()-3,FALSE),\"\")","v":""},{"$f":"IF($K$4<>0,HLOOKUP(CONCATENATE($K$4,\"2\"),$O$4:$XFD255,ROW()-3,FALSE),\"\")","v":""},{"$nulls":3},{"$f":"IF(OR($E255=\"\",$F255=\"\",O255=\"\",P255=\"\"),\"\",IF(AND(O255=$E255,P255=$F255),Reglement!$S$3*$J255,IF(SIGN($E255-$F255)=SIGN(O255-P255),Reglement!$S$4*$J255,0))*IF(AND($E255+$F255>=6,O255+P255>=6),Reglement!$S$29,IF(AND($E255+$F255>=4,O255+P255>=4),Reglement!$S$28,1)))","v":""}]
["JOURNEE n°26",null,{"$f":"Score!T85","v":"Arsenal"},{"$f":"Score!W85","v":"Newcastle"},{"$f":"IF(Score!U85<>\"\",Score!U85,\"\")","v":""},{"$f":"IF(Score!V85<>\"\",Score!V85,\"\")","v":""},1,1,1,"",{"$f":"IF($K$4<>0,HLOOKUP($K$4,$O$4:$XFD256,ROW()-3,FALSE),\"\")","v":""},{"$f":"IF($K$4<>0,HLOOKUP(CONCATENATE($K$4,\"1\"),$O$4:$XFD256,ROW()-3,FALSE),\"\")","v":""},{"$f":"IF($K$4<>0,HLOOKUP(CONCATENATE($K$4,\"2\"),$O$4:$XFD256,ROW()-3,FALSE),\"\")","v":""},{"$nulls":3},{"$f":"IF(OR($E256=\"\",$F256=\"\",O256=\"\",P256=\"\"),\"\",IF(AND(O256=$E256,P256=$F256),Reglement!$S$3*$J256,IF(SIGN($E256-$F256)=SIGN(O256-P256),Reglement!$S$4*$J256,0))*IF(AND($E256+$F256>=6,O256+P256>=6),Reglement!$S$29,IF(AND($E256+$F256>=4,O256+P256>=4),Reglement!$S$28,1)))","v":""}]
[null,null,{"$f":"Score!T86","v":"Aston Villa"},{"$f":"Score!W86","v":"Tottenham"},{"$f":"IF(Score!U86<>\"\",Score!U86,\"\")","v":""},{"$f":"IF(Score!V86<>\"\",Score!V86,\"\")","v":""},1,1,1,"",{"$f":"IF($K$4<>0,HLOOKUP($K$4,$O$4:$XFD257,ROW()-3,FALSE),\"\")","v":""},{"$f":"IF($K$4<>0,HLOOKUP(CONCATENATE($K$4,\"1\"),$O$4:$XFD257,ROW()-3,FALSE),\"\")","v":""},{"$f":"IF($K$4<>0,HLOOKUP(CONCATENATE($K$4,\"2\"),$O$4:$XFD257,ROW()-3,FALSE),\"\")","v":""},{"$nulls":3},{"$f":"IF(OR($E257=\"\",$F257=\"\",O257=\"\",P257=\"\"),\"\",IF(AND(O257=$E257,P257=$F257),Reglement!$S$3*$J257,IF(SIGN($E257-$F257)=SIGN(O257-P257),Reglement!$S$4*$J257,0))*IF(AND($E257+$F257>=6,O257+P257>=6),Reglement!$S$29,IF(AND($E257+$F257>=4,O257+P257>=4),Reglement!$S$28,1)))","v":""}]
[null,null,{"$f":"Score!T87","v":"Brighton"},{"$f":"Score!W87","v":"Watford"},{"$f":"IF(Score!U87<>\"\",Score!U87,\"\")","v":""},{"$f":"IF(Score!V87<>\"\",Score!V87,\"\")","v":""},1,1,1,"",{"$f":"IF($K$4<>0,HLOOKUP($K$4,$O$4:$XFD258,ROW()-3,FALSE),\"\")","v":""},{"$f":"IF($K$4<>0,HLOOKUP(CONCATENATE($K$4,\"1\"),$O$4:$XFD258,ROW()-3,FALSE),\"\")","v":""},{"$f":"IF($K$4<>0,HLOOKUP(CONCATENATE($K$4,\"2\"),$O$4:$XFD258,ROW()-3,FALSE),\"\")","v":""},{"$nulls":3},{"$f":"IF(OR($E258=\"\",$F258=\"\",O258=\"\",P258=\"\"),\"\",IF(AND(O258=$E258,P258=$F258),Reglement!$S$3*$J258,IF(SIGN($E258-$F258)=SIGN(O258-P258),Reglement!$S$4*$J258,0))*IF(AND($E258+$F258>=6,O258+P258>=6),Reglement!$S$29,IF(AND($E258+$F258>=4,O258+P258>=4),Reglement!$S$28,1)))","v":""}]
[null,null,{"$f":"Score!T88","v":"Chelsea"},{"$f":"Score!W88","v":"Manchester United"},{"$f":"IF(Score!U88<>\"\",Score!U88,\"\")","v":""},{"$f":"IF(Score!V88<>\"\",Score!V88,\"\")","v":""},1,1,1,"",{"$f":"IF($K$4<>0,HLOOKUP($K$4,$O$4:$XFD259,ROW()-3,FALSE),\"\")","v":""},{"$f":"IF($K$4<>0,HLOOKUP(CONCATENATE($K$4,\"1\"),$O$4:$XFD259,ROW()-3,FALSE),\"\")","v":""},{"$f":"IF($K$4<>0,HLOOKUP(CONCATENATE($K$4,\"2\"),$O$4:$XFD259,ROW()-3,FALSE),\"\")","v":""},{"$nulls":3},{"$f":"IF(OR($E259=\"\",$F259=\"\",O259=\"\",P259=\"\"),\"\",IF(AND(O259=$E259,P259=$F259),Reglement!$S$3*$J259,IF(SIGN($E259-$F259)=SIGN(O259-P259),Reglement!$S$4*$J259,0))*IF(AND($E259+$F259>=6,O259+P259>=6),Reglement!$S$29,IF(AND($E259+$F259>=4,O259+P259>=4),Reglement!$S$28,1)))","v":""}]
[null,null,{"$f":"Score!T89","v":"Everton"},{"$f":"Score!W89","v":"Crystal Palace"},{"$f":"IF(Score!U89<>\"\",Score!U89,\"\")","v":""},{"$f":"IF(Score!V89<>\"\",Score!V89,\"\")","v":""},1,1,1,"",{"$f":"IF($K$4<>0,HLOOKUP($K$4,$O$4:$XFD260,ROW()-3,FALSE),\"\")","v":""},{"$f":"IF($K$4<>0,HLOOKUP(CONCATENATE($K$4,\"1\"),$O$4:$XFD260,ROW()-3,FALSE),\"\")","v":""},{"$f":"IF($K$4<>0,HLOOKUP(CONCATENATE($K$4,\"2\"),$O$4:$XFD260,ROW()-3,FALSE),\"\")","v":""},{"$nulls":3},{"$f":"IF(OR($E260=\"\",$F260=\"\",O260=\"\",P260=\"\"),\"\",IF(AND(O260=$E260,P260=$F260),Reglement!$S$3*$J260,IF(SIGN($E260-$F260)=SIGN(O260-P260),Reglement!$S$4*$J260,0))*IF(AND($E260+$F260>=6,O260+P260>=6),Reglement!$S$29,IF(AND($E260+$F260>=4,O260+P260>=4),Reglement!$S$28,1)))","v":""}]
[null,null,{"$f":"Score!T90","v":"Manchester City"},{"$f":"Score!W90","v":"West Ham"},{"$f":"IF(Score!U90<>\"\",Score!U90,\"\")","v":""},{"$f":"IF(Score!V90<>\"\",Score!V90,\"\")","v":""},1,1,1,"",{"$f":"IF($K$4<>0,HLOOKUP($K$4,$O$4:$XFD261,ROW()-3,FALSE),\"\")","v":""},{"$f":"IF($K$4<>0,HLOOKUP(CONCATENATE($K$4,\"1\"),$O$4:$XFD261,ROW()-3,FALSE),\"\")","v":""},{"$f":"IF($K$4<>0,HLOOKUP(CONCATENATE($K$4,\"2\"),$O$4:$XFD261,ROW()-3,FALSE),\"\")","v":""},{"$nulls":3},{"$f":"IF(OR($E261=\"\",$F261=\"\",O261=\"\",P261=\"\"),\"\",IF(AND(O261=$E261,P261=$F261),Reglement!$S$3*$J261,IF(SIGN($E261-$F261)=SIGN(O261-P261),Reglement!$S$4*$J261,0))*IF(AND($E261+$F261>=6,O261+P261>=6),Reglement!$S$29,IF(AND($E261+$F261>=4,O261+P261>=4),Reglement!$S$28,1)))","v":""}]
[null,null,{"$f":"Score!T91","v":"Norwich"},{"$f":"Score!W91","v":"Liverpool"},{"$f":"IF(Score!U91<>\"\",Score!U91,\"\")","v":""},{"$f":"IF(Score!V91<>\"\",Score!V91,\"\")","v":""},1,1,1,"",{"$f":"IF($K$4<>0,HLOOKUP($K$4,$O$4:$XFD262,ROW()-3,FALSE),\"\")","v":""},{"$f":"IF($K$4<>0,HLOOKUP(CONCATENATE($K$4,\"1\"),$O$4:$XFD262,ROW()-3,FALSE),\"\")","v":""},{"$f":"IF($K$4<>0,HLOOKUP(CONCATENATE($K$4,\"2\"),$O$4:$XFD262,ROW()-3,FALSE),\"\")","v":""},{"$nulls":3},{"$f":"IF(OR($E262=\"\",$F262=\"\",O262=\"\",P262=\"\"),\"\",IF(AND(O262=$E262,P262=$F262),Reglement!$S$3*$J262,IF(SIGN($E262-$F262)=SIGN(O262-P262),Reglement!$S$4*$J262,0))*IF(AND($E262+$F262>=6,O262+P262>=6),Reglement!$S$29,IF(AND($E262+$F262>=4,O262+P262>=4),Reglement!$S$28,1)))","v":""}]
[null,null,{"$f":"Score!T92","v":"Sheffield United"},{"$f":"Score!W92","v":"Bournemouth"},{"$f":"IF(Score!U92<>\"\",Score!U92,\"\")","v":""},{"$f":"IF(Score!V92<>\"\",Score!V92,\"\")","v":""},1,1,1,"",{"$f":"IF($K$4<>0,HLOOKUP($K$4,$O$4:$XFD263,ROW()-3,FALSE),\"\")","v":""},{"$f":"IF($K$4<>0,HLOOKUP(CONCATENATE($K$4,\"1\"),$O$4:$XFD263,ROW()-3,FALSE),\"\")","v":""},{"$f":"IF($K$4<>0,HLOOKUP(CONCATENATE($K$4,\"2\"),$O$4:$XFD263,ROW()-3,FALSE),\"\")","v":""},{"$nulls":3},{"$f":"IF(OR($E263=\"\",$F263=\"\",O263=\"\",P263=\"\"),\"\",IF(AND(O263=$E263,P263=$F263),Reglement!$S$3*$J263,IF(SIGN($E263-$F263)=SIGN(O263-P263),Reglement!$S$4*$J263,0))*IF(AND($E263+$F263>=6,O263+P263>=6),Reglement!$S$29,IF(AND($E263+$F263>=4,O263+P263>=4),Reglement!$S$28,1)))","v":""}]
[null,null,{"$f":"Score!T93","v":"Southampton"},{"$f":"Score!W93","v":"Burnley"},{"$f":"IF(Score!U93<>\"\",Score!U93,\"\")","v":""},{"$f":"IF(Score!V93<>\"\",Score!V93,\"\")","v":""},1,1,1,"",{"$f":"IF($K$4<>0,HLOOKUP($K$4,$O$4:$XFD264,ROW()-3,FALSE),\"\")","v":""},{"$f":"IF($K$4<>0,HLOOKUP(CONCATENATE($K$4,\"1\"),$O$4:$XFD264,ROW()-3,FALSE),\"\")","v":""},{"$f":"IF($K$4<>0,HLOOKUP(CONCATENATE($K$4,\"2\"),$O$4:$XFD264,ROW()-3,FALSE),\"\")","v":""},{"$nulls":3},{"$f":"IF(OR($E264=\"\",$F264=\"\",O264=\"\",P264=\"\"),\"\",IF(AND(O264=$E264,P264=$F264),Reglement!$S$3*$J264,IF(SIGN($E264-$F264)=SIGN(O264-P264),Reglement!$S$4*$J264,0))*IF(AND($E264+$F264>=6,O264+P264>=6),Reglement!$S$29,IF(AND($E264+$F264>=4,O264+P264>=4),Reglement!$S$28,1)))","v":""}]
[null,null,{"$f":"Score!T94","v":"Wolverhampton"},{"$f":"Score!W94","v":"Leicester City"},{"$f":"IF(Score!U94<>\"\",Score!U94,\"\")","v":""},{"$f":"IF(Score!V94<>\"\",Score!V94,\"\")","v":""},1,1,1,"",{"$f":"IF($K$4<>0,HLOOKUP($K$4,$O$4:$XFD265,ROW()-3,FALSE),\"\")","v":""},{"$f":"IF($K$4<>0,HLOOKUP(CONCATENATE($K$4,\"1\"),$O$4:$XFD265,ROW()-3,FALSE),\"\")","v":""},{"$f":"IF($K$4<>0,HLOOKUP(CONCATENATE($K$4,\"2\"),$O$4:$XFD265,ROW()-3,FALSE),\"\")","v":""},{"$nulls":3},{"$f":"IF(OR($E265=\"\",$F265=\"\",O265=\"\",P265=\"\"),\"\",IF(AND(O265=$E265,P265=$F265),Reglement!$S$3*$J265,IF(SIGN($E265-$F265)=SIGN(O265-P265),Reglement!$S$4*$J265,0))*IF(AND($E265+$F265>=6,O265+P265>=6),Reglement!$S$29,IF(AND($E265+$F265>=4,O265+P265>=4),Reglement!$S$28,1)))","v":""}]
["JOURNEE n°27",null,{"$f":"Score!T98","v":"Arsenal"},{"$f":"Score!W98","v":"Everton"},{"$f":"IF(Score!U98<>\"\",Score!U98,\"\")","v":""},{"$f":"IF(Score!V98<>\"\",Score!V98,\"\")","v":""},1,1,1,"",{"$f":"IF($K$4<>0,HLOOKUP($K$4,$O$4:$XFD266,ROW()-3,FALSE),\"\")","v":""},{"$f":"IF($K$4<>0,HLOOKUP(CONCATENATE($K$4,\"1\"),$O$4:$XFD266,ROW()-3,FALSE),\"\")","v":""},{"$f":"IF($K$4<>0,HLOOKUP(CONCATENATE($K$4,\"2\"),$O$4:$XFD266,ROW()-3,FALSE),\"\")","v":""},{"$nulls":3},{"$f":"IF(OR($E266=\"\",$F266=\"\",O266=\"\",P266=\"\"),\"\",IF(AND(O266=$E266,P266=$F266),Reglement!$S$3*$J266,IF(SIGN($E266-$F266)=SIGN(O266-P266),Reglement!$S$4*$J266,0))*IF(AND($E266+$F266>=6,O266+P266>=6),Reglement!$S$29,IF(AND($E266+$F266>=4,O266+P266>=4),Reglement!$S$28,1)))","v":""}]
[null,null,{"$f":"Score!T99","v":"Burnley"},{"$f":"Score!W99","v":"Bournemouth"},{"$f":"IF(Score!U99<>\"\",Score!U99,\"\")","v":""},{"$f":"IF(Score!V99<>\"\",Score!V99,\"\")","v":""},1,1,1,"",{"$f":"IF($K$4<>0,HLOOKUP($K$4,$O$4:$XFD267,ROW()-3,FALSE),\"\")","v":""},{"$f":"IF($K$4<>0,HLOOKUP(CONCATENATE($K$4,\"1\"),$O$4:$XFD267,ROW()-3,FALSE),\"\")","v":""},{"$f":"IF($K$4<>0,HLOOKUP(CONCATENATE($K$4,\"2\"),$O$4:$XFD267,ROW()-3,FALSE),\"\")","v":""},{"$nulls":3},{"$f":"IF(OR($E267=\"\",$F267=\"\",O267=\"\",P267=\"\"),\"\",IF(AND(O267=$E267,P267=$F267),Reglement!$S$3*$J267,IF(SIGN($E267-$F267)=SIGN(O267-P267),Reglement!$S$4*$J267,0))*IF(AND($E267+$F267>=6,O267+P267>=6),Reglement!$S$29,IF(AND($E267+$F267>=4,O267+P267>=4),Reglement!$S$28,1)))","v":""}]
[null,null,{"$f":"Score!T100","v":"Chelsea"},{"$f":"Score!W100","v":"Tottenham"},{"$f":"IF(Score!U100<>\"\",Score!U100,\"\")","v":""},{"$f":"IF(Score!V100<>\"\",Score!V100,\"\")","v":""},1,1,1,"",{"$f":"IF($K$4<>0,HLOOKUP($K$4,$O$4:$XFD268,ROW()-3,FALSE),\"\")","v":""},{"$f":"IF($K$4<>0,HLOOKUP(CONCATENATE($K$4,\"1\"),$O$4:$XFD268,ROW()-3,FALSE),\"\")","v":""},{"$f":"IF($K$4<>0,HLOOKUP(CONCATENATE($K$4,\"2\"),$O$4:$XFD268,ROW()-3,FALSE),\"\")","v":""},{"$nulls":3},{"$f":"IF(OR($E268=\"\",$F268=\"\",O268=\"\",P268=\"\"),\"\",IF(AND(O268=$E268,P268=$F268),Reglement!$S$3*$J268,IF(SIGN($E268-$F268)=SIGN(O268-P268),Reglement!$S$4*$J268,0))*IF(AND($E268+$F268>=6,O268+P268>=6),Reglement!$S$29,IF(AND($E268+$F268>=4,O268+P268>=4),Reglement!$S$28,1)))","v":""}]
[null,null,{"$f":"Score!T101","v":"Crystal Palace"},{"$f":"Score!W101","v":"Newcastle"},{"$f":"IF(Score!U101<>\"\",Score!U101,\"\")","v":""},{"$f":"IF(Score!V101<>\"\",Score!V101,\"\")","v":""},1,1,1,"",{"$f":"IF($K$4<>0,HLOOKUP($K$4,$O$4:$XFD269,ROW()-3,FALSE),\"\")","v":""},{"$f":"IF($K$4<>0,HLOOKUP(CONCATENATE($K$4,\"1\"),$O$4:$XFD269,ROW()-3,FALSE),\"\")","v":""},{"$f":"IF($K$4<>0,HLOOKUP(CONCATENATE($K$4,\"2\"),$O$4:$XFD269,ROW()-3,FALSE),\"\")","v":""},{"$nulls":3},{"$f":"IF(OR($E269=\"\",$F269=\"\",O269=\"\",P269=\"\"),\"\",IF(AND(O269=$E269,P269=$F269),Reglement!$S$3*$J269,IF(SIGN($E269-$F269)=SIGN(O269-P269),Reglement!$S$4*$J269,0))*IF(AND($E269+$F269>=6,O269+P269>=6),Reglement!$S$29,IF(AND($E269+$F269>=4,O269+P269>=4),Reglement!$S$28,1)))","v":""}]
[null,null,{"$f":"Score!T102","v":"Leicester City"},{"$f":"Score!W102","v":"Manchester City"},{"$f":"IF(Score!U102<>\"\",Score!U102,\"\")","v":""},{"$f":"IF(Score!V102<>\"\",Score!V102,\"\")","v":""},1,1,1,"",{"$f":"IF($K$4<>0,HLOOKUP($K$4,$O$4:$XFD270,ROW()-3,FALSE),\"\")","v":""},{"$f":"IF($K$4<>0,HLOOKUP(CONCATENATE($K$4,\"1\"),$O$4:$XFD270,ROW()-3,FALSE),\"\")","v":""},{"$f":"IF($K$4<>0,HLOOKUP(CONCATENATE($K$4,\"2\"),$O$4:$XFD270,ROW()-3,FALSE),\"\")","v":""},{"$nulls":3},{"$f":"IF(OR($E270=\"\",$F270=\"\",O270=\"\",P270=\"\"),\"\",IF(AND(O270=$E270,P270=$F270),Reglement!$S$3*$J270,IF(SIGN($E270-$F270)=SIGN(O270-P270),Reglement!$S$4*$J270,0))*IF(AND($E270+$F270>=6,O270+P270>=6),Reglement!$S$29,IF(AND($E270+$F270>=4,O270+P270>=4),Reglement!$S$28,1)))","v":""}]
[null,null,{"$f":"Score!T103","v":"Liverpool"},{"$f":"Score!W103","v":"West Ham"},{"$f":"IF(Score!U103<>\"\",Score!U103,\"\")","v":""},{"$f":"IF(Score!V103<>\"\",Score!V103,\"\")","v":""},1,1,1,{"$f":"IF(OR(E271=\"\",F271=\"\"),\"\",IF(E271>F271,G271,IF(E271=F271,H271,I271)))","v":""},{"$f":"IF($K$4<>0,HLOOKUP($K$4,$O$4:$XFD271,ROW()-3,FALSE),\"\")","v":""},{"$f":"IF($K$4<>0,HLOOKUP(CONCATENATE($K$4,\"1\"),$O$4:$XFD271,ROW()-3,FALSE),\"\")","v":""},{"$f":"IF($K$4<>0,HLOOKUP(CONCATENATE($K$4,\"2\"),$O$4:$XFD271,ROW()-3,FALSE),\"\")","v":""},{"$nulls":3},{"$f":"IF(OR($E271=\"\",$F271=\"\",O271=\"\",P271=\"\"),\"\",IF(AND(O271=$E271,P271=$F271),Reglement!$S$3*$J271,IF(SIGN($E271-$F271)=SIGN(O271-P271),Reglement!$S$4*$J271,0))*IF(AND($E271+$F271>=6,O271+P271>=6),Reglement!$S$29,IF(AND($E271+$F271>=4,O271+P271>=4),Reglement!$S$28,1)))","v":""}]
[null,null,{"$f":"Score!T104","v":"Manchester United"},{"$f":"Score!W104","v":"Watford"},{"$f":"IF(Score!U104<>\"\",Score!U104,\"\")","v":""},{"$f":"IF(Score!V104<>\"\",Score!V104,\"\")","v":""},1,1,1,"",{"$f":"IF($K$4<>0,HLOOKUP($K$4,$O$4:$XFD272,ROW()-3,FALSE),\"\")","v":""},{"$f":"IF($K$4<>0,HLOOKUP(CONCATENATE($K$4,\"1\"),$O$4:$XFD272,ROW()-3,FALSE),\"\")","v":""},{"$f":"IF($K$4<>0,HLOOKUP(CONCATENATE($K$4,\"2\"),$O$4:$XFD272,ROW()-3,FALSE),\"\")","v":""},{"$nulls":3},{"$f":"IF(OR($E272=\"\",$F272=\"\",O272=\"\",P272=\"\"),\"\",IF(AND(O272=$E272,P272=$F272),Reglement!$S$3*$J272,IF(SIGN($E272-$F272)=SIGN(O272-P272),Reglement!$S$4*$J272,0))*IF(AND($E272+$F272>=6,O272+P272>=6),Reglement!$S$29,IF(AND($E272+$F272>=4,O272+P272>=4),Reglement!$S$28,1)))","v":""}]
[null,null,{"$f":"Score!T105","v":"Sheffield United"},{"$f":"Score!W105","v":"Brighton"},{"$f":"IF(Score!U105<>\"\",Score!U105,\"\")","v":""},{"$f":"IF(Score!V105<>\"\",Score!V105,\"\")","v":""},1,1,1,"",{"$f":"IF($K$4<>0,HLOOKUP($K$4,$O$4:$XFD273,ROW()-3,FALSE),\"\")","v":""},{"$f":"IF($K$4<>0,HLOOKUP(CONCATENATE($K$4,\"1\"),$O$4:$XFD273,ROW()-3,FALSE),\"\")","v":""},{"$f":"IF($K$4<>0,HLOOKUP(CONCATENATE($K$4,\"2\"),$O$4:$XFD273,ROW()-3,FALSE),\"\")","v":""},{"$nulls":3},{"$f":"IF(OR($E273=\"\",$F273=\"\",O273=\"\",P273=\"\"),\"\",IF(AND(O273=$E273,P273=$F273),Reglement!$S$3*$J273,IF(SIGN($E273-$F273)=SIGN(O273-P273),Reglement!$S$4*$J273,0))*IF(AND($E273+$F273>=6,O273+P273>=6),Reglement!$S$29,IF(AND($E273+$F273>=4,O273+P273>=4),Reglement!$S$28,1)))","v":""}]
[null,null,{"$f":"Score!T106","v":"Southampton"},{"$f":"Score!W106","v":"Aston Villa"},{"$f":"IF(Score!U106<>\"\",Score!U106,\"\")","v":""},{"$f":"IF(Score!V106<>\"\",Score!V106,\"\")","v":""},1,1,1,"",{"$f":"IF($K$4<>0,HLOOKUP($K$4,$O$4:$XFD274,ROW()-3,FALSE),\"\")","v":""},{"$f":"IF($K$4<>0,HLOOKUP(CONCATENATE($K$4,\"1\"),$O$4:$XFD274,ROW()-3,FALSE),\"\")","v":""},{"$f":"IF($K$4<>0,HLOOKUP(CONCATENATE($K$4,\"2\"),$O$4:$XFD274,ROW()-3,FALSE),\"\")","v":""},{"$nulls":3},{"$f":"IF(OR($E274=\"\",$F274=\"\",O274=\"\",P274=\"\"),\"\",IF(AND(O274=$E274,P274=$F274),Reglement!$S$3*$J274,IF(SIGN($E274-$F274)=SIGN(O274-P274),Reglement!$S$4*$J274,0))*IF(AND($E274+$F274>=6,O274+P274>=6),Reglement!$S$29,IF(AND($E274+$F274>=4,O274+P274>=4),Reglement!$S$28,1)))","v":""}]
[null,null,{"$f":"Score!T107","v":"Wolverhampton"},{"$f":"Score!W107","v":"Norwich"},{"$f":"IF(Score!U107<>\"\",Score!U107,\"\")","v":""},{"$f":"IF(Score!V107<>\"\",Score!V107,\"\")","v":""},1,1,1,"",{"$f":"IF($K$4<>0,HLOOKUP($K$4,$O$4:$XFD275,ROW()-3,FALSE),\"\")","v":""},{"$f":"IF($K$4<>0,HLOOKUP(CONCATENATE($K$4,\"1\"),$O$4:$XFD275,ROW()-3,FALSE),\"\")","v":""},{"$f":"IF($K$4<>0,HLOOKUP(CONCATENATE($K$4,\"2\"),$O$4:$XFD275,ROW()-3,FALSE),\"\")","v":""},{"$nulls":3},{"$f":"IF(OR($E275=\"\",$F275=\"\",O275=\"\",P275=\"\"),\"\",IF(AND(O275=$E275,P275=$F275),Reglement!$S$3*$J275,IF(SIGN($E275-$F275)=SIGN(O275-P275),Reglement!$S$4*$J275,0))*IF(AND($E275+$F275>=6,O275+P275>=6),Reglement!$S$29,IF(AND($E275+$F275>=4,O275+P275>=4),Reglement!$S$28,1)))","v":""}]
["JOURNEE n°28",null,{"$f":"Score!T111","v":"Bournemouth"},{"$f":"Score!W111","v":"Chelsea"},{"$f":"IF(Score!U111<>\"\",Score!U111,\"\")","v":""},{"$f":"IF(Score!V111<>\"\",Score!V111,\"\")","v":""},1,1,1,"",{"$f":"IF($K$4<>0,HLOOKUP($K$4,$O$4:$XFD276,ROW()-3,FALSE),\"\")","v":""},{"$f":"IF($K$4<>0,HLOOKUP(CONCATENATE($K$4,\"1\"),$O$4:$XFD276,ROW()-3,FALSE),\"\")","v":""},{"$f":"IF($K$4<>0,HLOOKUP(CONCATENATE($K$4,\"2\"),$O$4:$XFD276,ROW()-3,FALSE),\"\")","v":""},{"$nulls":3},{"$f":"IF(OR($E276=\"\",$F276=\"\",O276=\"\",P276=\"\"),\"\",IF(AND(O276=$E276,P276=$F276),Reglement!$S$3*$J276,IF(SIGN($E276-$F276)=SIGN(O276-P276),Reglement!$S$4*$J276,0))*IF(AND($E276+$F276>=6,O276+P276>=6),Reglement!$S$29,IF(AND($E276+$F276>=4,O276+P276>=4),Reglement!$S$28,1)))","v":""}]
[null,null,{"$f":"Score!T112","v":"Aston Villa"},{"$f":"Score!W112","v":"Sheffield United"},{"$f":"IF(Score!U112<>\"\",Score!U112,\"\")","v":""},{"$f":"IF(Score!V112<>\"\",Score!V112,\"\")","v":""},1,1,1,"",{"$f":"IF($K$4<>0,HLOOKUP($K$4,$O$4:$XFD277,ROW()-3,FALSE),\"\")","v":""},{"$f":"IF($K$4<>0,HLOOKUP(CONCATENATE($K$4,\"1\"),$O$4:$XFD277,ROW()-3,FALSE),\"\")","v":""},{"$f":"IF($K$4<>0,HLOOKUP(CONCATENATE($K$4,\"2\"),$O$4:$XFD277,ROW()-3,FALSE),\"\")","v":""},{"$nulls":3},{"$f":"IF(OR($E277=\"\",$F277=\"\",O277=\"\",P277=\"\"),\"\",IF(AND(O277=$E277,P277=$F277),Reglement!$S$3*$J277,IF(SIGN($E277-$F277)=SIGN(O277-P277),Reglement!$S$4*$J277,0))*IF(AND($E277+$F277>=6,O277+P277>=6),Reglement!$S$29,IF(AND($E277+$F277>=4,O277+P277>=4),Reglement!$S$28,1)))","v":""}]
[null,null,{"$f":"Score!T113","v":"Brighton"},{"$f":"Score!W113","v":"Crystal Palace"},{"$f":"IF(Score!U113<>\"\",Score!U113,\"\")","v":""},{"$f":"IF(Score!V113<>\"\",Score!V113,\"\")","v":""},1,1,1,"",{"$f":"IF($K$4<>0,HLOOKUP($K$4,$O$4:$XFD278,ROW()-3,FALSE),\"\")","v":""},{"$f":"IF($K$4<>0,HLOOKUP(CONCATENATE($K$4,\"1\"),$O$4:$XFD278,ROW()-3,FALSE),\"\")","v":""},{"$f":"IF($K$4<>0,HLOOKUP(CONCATENATE($K$4,\"2\"),$O$4:$XFD278,ROW()-3,FALSE),\"\")","v":""},{"$nulls":3},{"$f":"IF(OR($E278=\"\",$F278=\"\",O278=\"\",P278=\"\"),\"\",IF(AND(O278=$E278,P278=$F278),Reglement!$S$3*$J278,IF(SIGN($E278-$F278)=SIGN(O278-P278),Reglement!$S$4*$J278,0))*IF(AND($E278+$F278>=6,O278+P278>=6),Reglement!$S$29,IF(AND($E278+$F278>=4,O278+P278>=4),Reglement!$S$28,1)))","v":""}]
[null,null,{"$f":"Score!T114","v":"Everton"},{"$f":"Score!W114","v":"Manchester United"},{"$f":"IF(Score!U114<>\"\",Score!U114,\"\")","v":""},{"$f":"IF(Score!V114<>\"\",Score!V114,\"\")","v":""},1,1,1,"",{"$f":"IF($K$4<>0,HLOOKUP($K$4,$O$4:$XFD279,ROW()-3,FALSE),\"\")","v":""},{"$f":"IF($K$4<>0,HLOOKUP(CONCATENATE($K$4,\"1\"),$O$4:$XFD279,ROW()-3,FALSE),\"\")","v":""},{"$f":"IF($K$4<>0,HLOOKUP(CONCATENATE($K$4,\"2\"),$O$4:$XFD279,ROW()-3,FALSE),\"\")","v":""},{"$nulls":3},{"$f":"IF(OR($E279=\"\",$F279=\"\",O279=\"\",P279=\"\"),\"\",IF(AND(O279=$E279,P279=$F279),Reglement!$S$3*$J279,IF(SIGN($E279-$F279)=SIGN(O279-P279),Reglement!$S$4*$J279,0))*IF(AND($E279+$F279>=6,O279+P279>=6),Reglement!$S$29,IF(AND($E279+$F279>=4,O279+P279>=4),Reglement!$S$28,1)))","v":""}]
[null,null,{"$f":"Score!T115","v":"Manchester City"},{"$f":"Score!W115","v":"Arsenal"},{"$f":"IF(Score!U115<>\"\",Score!U115,\"\")","v":""},{"$f":"IF(Score!V115<>\"\",Score!V115,\"\")","v":""},1,1,1,{"$f":"IF(OR(E280=\"\",F280=\"\"),\"\",IF(E280>F280,G280,IF(E280=F280,H280,I280)))","v":""},{"$f":"IF($K$4<>0,HLOOKUP($K$4,$O$4:$XFD280,ROW()-3,FALSE),\"\")","v":""},{"$f":"IF($K$4<>0,HLOOKUP(CONCATENATE($K$4,\"1\"),$O$4:$XFD280,ROW()-3,FALSE),\"\")","v":""},{"$f":"IF($K$4<>0,HLOOKUP(CONCATENATE($K$4,\"2\"),$O$4:$XFD280,ROW()-3,FALSE),\"\")","v":""},{"$nulls":3},{"$f":"IF(OR($E280=\"\",$F280=\"\",O280=\"\",P280=\"\"),\"\",IF(AND(O280=$E280,P280=$F280),Reglement!$S$3*$J280,IF(SIGN($E280-$F280)=SIGN(O280-P280),Reglement!$S$4*$J280,0))*IF(AND($E280+$F280>=6,O280+P280>=6),Reglement!$S$29,IF(AND($E280+$F280>=4,O280+P280>=4),Reglement!$S$28,1)))","v":""}]
[null,null,{"$f":"Score!T116","v":"Newcastle"},{"$f":"Score!W116","v":"Burnley"},{"$f":"IF(Score!U116<>\"\",Score!U116,\"\")","v":""},{"$f":"IF(Score!V116<>\"\",Score!V116,\"\")","v":""},1,1,1,"",{"$f":"IF($K$4<>0,HLOOKUP($K$4,$O$4:$XFD281,ROW()-3,FALSE),\"\")","v":""},{"$f":"IF($K$4<>0,HLOOKUP(CONCATENATE($K$4,\"1\"),$O$4:$XFD281,ROW()-3,FALSE),\"\")","v":""},{"$f":"IF($K$4<>0,HLOOKUP(CONCATENATE($K$4,\"2\"),$O$4:$XFD281,ROW()-3,FALSE),\"\")","v":""},{"$nulls":3},{"$f":"IF(OR($E281=\"\",$F281=\"\",O281=\"\",P281=\"\"),\"\",IF(AND(O281=$E281,P281=$F281),Reglement!$S$3*$J281,IF(SIGN($E281-$F281)=SIGN(O281-P281),Reglement!$S$4*$J281,0))*IF(AND($E281+$F281>=6,O281+P281>=6),Reglement!$S$29,IF(AND($E281+$F281>=4,O281+P281>=4),Reglement!$S$28,1)))","v":""}]
[null,null,{"$f":"Score!T117","v":"Norwich"},{"$f":"Score!W117","v":"Leicester City"},{"$f":"IF(Score!U117<>\"\",Score!U117,\"\")","v":""},{"$f":"IF(Score!V117<>\"\",Score!V117,\"\")","v":""},1,1,1,"",{"$f":"IF($K$4<>0,HLOOKUP($K$4,$O$4:$XFD282,ROW()-3,FALSE),\"\")","v":""},{"$f":"IF($K$4<>0,HLOOKUP(CONCATENATE($K$4,\"1\"),$O$4:$XFD282,ROW()-3,FALSE),\"\")","v":""},{"$f":"IF($K$4<>0,HLOOKUP(CONCATENATE($K$4,\"2\"),$O$4:$XFD282,ROW()-3,FALSE),\"\")","v":""},{"$nulls":3},{"$f":"IF(OR($E282=\"\",$F282=\"\",O282=\"\",P282=\"\"),\"\",IF(AND(O282=$E282,P282=$F282),Reglement!$S$3*$J282,IF(SIGN($E282-$F282)=SIGN(O282-P282),Reglement!$S$4*$J282,0))*IF(AND($E282+$F282>=6,O282+P282>=6),Reglement!$S$29,IF(AND($E282+$F282>=4,O282+P282>=4),Reglement!$S$28,1)))","v":""}]
[null,null,{"$f":"Score!T118","v":"Tottenham"},{"$f":"Score!W118","v":"Wolverhampton"},{"$f":"IF(Score!U118<>\"\",Score!U118,\"\")","v":""},{"$f":"IF(Score!V118<>\"\",Score!V118,\"\")","v":""},1,1,1,"",{"$f":"IF($K$4<>0,HLOOKUP($K$4,$O$4:$XFD283,ROW()-3,FALSE),\"\")","v":""},{"$f":"IF($K$4<>0,HLOOKUP(CONCATENATE($K$4,\"1\"),$O$4:$XFD283,ROW()-3,FALSE),\"\")","v":""},{"$f":"IF($K$4<>0,HLOOKUP(CONCATENATE($K$4,\"2\"),$O$4:$XFD283,ROW()-3,FALSE),\"\")","v":""},{"$nulls":3},{"$f":"IF(OR($E283=\"\",$F283=\"\",O283=\"\",P283=\"\"),\"\",IF(AND(O283=$E283,P283=$F283),Reglement!$S$3*$J283,IF(SIGN($E283-$F283)=SIGN(O283-P283),Reglement!$S$4*$J283,0))*IF(AND($E283+$F283>=6,O283+P283>=6),Reglement!$S$29,IF(AND($E283+$F283>=4,O283+P283>=4),Reglement!$S$28,1)))","v":""}]
[null,null,{"$f":"Score!T119","v":"Watford"},{"$f":"Score!W119","v":"Liverpool"},{"$f":"IF(Score!U119<>\"\",Score!U119,\"\")","v":""},{"$f":"IF(Score!V119<>\"\",Score!V119,\"\")","v":""},1,1,1,"",{"$f":"IF($K$4<>0,HLOOKUP($K$4,$O$4:$XFD284,ROW()-3,FALSE),\"\")","v":""},{"$f":"IF($K$4<>0,HLOOKUP(CONCATENATE($K$4,\"1\"),$O$4:$XFD284,ROW()-3,FALSE),\"\")","v":""},{"$f":"IF($K$4<>0,HLOOKUP(CONCATENATE($K$4,\"2\"),$O$4:$XFD284,ROW()-3,FALSE),\"\")","v":""},{"$nulls":3},{"$f":"IF(OR($E284=\"\",$F284=\"\",O284=\"\",P284=\"\"),\"\",IF(AND(O284=$E284,P284=$F284),Reglement!$S$3*$J284,IF(SIGN($E284-$F284)=SIGN(O284-P284),Reglement!$S$4*$J284,0))*IF(AND($E284+$F284>=6,O284+P284>=6),Reglement!$S$29,IF(AND($E284+$F284>=4,O284+P284>=4),Reglement!$S$28,1)))","v":""}]
[null,null,{"$f":"Score!T120","v":"West Ham"},{"$f":"Score!W120","v":"Southampton"},{"$f":"IF(Score!U120<>\"\",Score!U120,\"\")","v":""},{"$f":"IF(Score!V120<>\"\",Score!V120,\"\")","v":""},1,1,1,"",{"$f":"IF($K$4<>0,HLOOKUP($K$4,$O$4:$XFD285,ROW()-3,FALSE),\"\")","v":""},{"$f":"IF($K$4<>0,HLOOKUP(CONCATENATE($K$4,\"1\"),$O$4:$XFD285,ROW()-3,FALSE),\"\")","v":""},{"$f":"IF($K$4<>0,HLOOKUP(CONCATENATE($K$4,\"2\"),$O$4:$XFD285,ROW()-3,FALSE),\"\")","v":""},{"$nulls":3},{"$f":"IF(OR($E285=\"\",$F285=\"\",O285=\"\",P285=\"\"),\"\",IF(AND(O285=$E285,P285=$F285),Reglement!$S$3*$J285,IF(SIGN($E285-$F285)=SIGN(O285-P285),Reglement!$S$4*$J285,0))*IF(AND($E285+$F285>=6,O285+P285>=6),Reglement!$S$29,IF(AND($E285+$F285>=4,O285+P285>=4),Reglement!$S$28,1)))","v":""}]
["JOURNEE n°29",null,{"$f":"Score!T124","v":"Arsenal"},{"$f":"Score!W124","v":"West Ham"},{"$f":"IF(Score!U124<>\"\",Score!U124,\"\")","v":""},{"$f":"IF(Score!V124<>\"\",Score!V124,\"\")","v":""},1,1,1,"",{"$f":"IF($K$4<>0,HLOOKUP($K$4,$O$4:$XFD286,ROW()-3,FALSE),\"\")","v":""},{"$f":"IF($K$4<>0,HLOOKUP(CONCATENATE($K$4,\"1\"),$O$4:$XFD286,ROW()-3,FALSE),\"\")","v":""},{"$f":"IF($K$4<>0,HLOOKUP(CONCATENATE($K$4,\"2\"),$O$4:$XFD286,ROW()-3,FALSE),\"\")","v":""},{"$nulls":3},{"$f":"IF(OR($E286=\"\",$F286=\"\",O286=\"\",P286=\"\"),\"\",IF(AND(O286=$E286,P286=$F286),Reglement!$S$3*$J286,IF(SIGN($E286-$F286)=SIGN(O286-P286),Reglement!$S$4*$J286,0))*IF(AND($E286+$F286>=6,O286+P286>=6),Reglement!$S$29,IF(AND($E286+$F286>=4,O286+P286>=4),Reglement!$S$28,1)))","v":""}]
[null,null,{"$f":"Score!T125","v":"Burnley"},{"$f":"Score!W125","v":"Tottenham"},{"$f":"IF(Score!U125<>\"\",Score!U125,\"\")","v":""},{"$f":"IF(Score!V125<>\"\",Score!V125,\"\")","v":""},1,1,1,"",{"$f":"IF($K$4<>0,HLOOKUP($K$4,$O$4:$XFD287,ROW()-3,FALSE),\"\")","v":""},{"$f":"IF($K$4<>0,HLOOKUP(CONCATENATE($K$4,\"1\"),$O$4:$XFD287,ROW()-3,FALSE),\"\")","v":""},{"$f":"IF($K$4<>0,HLOOKUP(CONCATENATE($K$4,\"2\"),$O$4:$XFD287,ROW()-3,FALSE),\"\")","v":""},{"$nulls":3},{"$f":"IF(OR($E287=\"\",$F287=\"\",O287=\"\",P287=\"\"),\"\",IF(AND(O287=$E287,P287=$F287),Reglement!$S$3*$J287,IF(SIGN($E287-$F287)=SIGN(O287-P287),Reglement!$S$4*$J287,0))*IF(AND($E287+$F287>=6,O287+P287>=6),Reglement!$S$29,IF(AND($E287+$F287>=4,O287+P287>=4),Reglement!$S$28,1)))","v":""}]
[null,null,{"$f":"Score!T126","v":"Chelsea"},{"$f":"Score!W126","v":"Everton"},{"$f":"IF(Score!U126<>\"\",Score!U126,\"\")","v":""},{"$f":"IF(Score!V126<>\"\",Score!V126,\"\")","v":""},1,1,1,"",{"$f":"IF($K$4<>0,HLOOKUP($K$4,$O$4:$XFD288,ROW()-3,FALSE),\"\")","v":""},{"$f":"IF($K$4<>0,HLOOKUP(CONCATENATE($K$4,\"1\"),$O$4:$XFD288,ROW()-3,FALSE),\"\")","v":""},{"$f":"IF($K$4<>0,HLOOKUP(CONCATENATE($K$4,\"2\"),$O$4:$XFD288,ROW()-3,FALSE),\"\")","v":""},{"$nulls":3},{"$f":"IF(OR($E288=\"\",$F288=\"\",O288=\"\",P288=\"\"),\"\",IF(AND(O288=$E288,P288=$F288),Reglement!$S$3*$J288,IF(SIGN($E288-$F288)=SIGN(O288-P288),Reglement!$S$4*$J288,0))*IF(AND($E288+$F288>=6,O288+P288>=6),Reglement!$S$29,IF(AND($E288+$F288>=4,O288+P288>=4),Reglement!$S$28,1)))","v":""}]
[null,null,{"$f":"Score!T127","v":"Crystal Palace"},{"$f":"Score!W127","v":"Watford"},{"$f":"IF(Score!U127<>\"\",Score!U127,\"\")","v":""},{"$f":"IF(Score!V127<>\"\",Score!V127,\"\")","v":""},1,1,1,"",{"$f":"IF($K$4<>0,HLOOKUP($K$4,$O$4:$XFD289,ROW()-3,FALSE),\"\")","v":""},{"$f":"IF($K$4<>0,HLOOKUP(CONCATENATE($K$4,\"1\"),$O$4:$XFD289,ROW()-3,FALSE),\"\")","v":""},{"$f":"IF($K$4<>0,HLOOKUP(CONCATENATE($K$4,\"2\"),$O$4:$XFD289,ROW()-3,FALSE),\"\")","v":""},{"$nulls":3},{"$f":"IF(OR($E289=\"\",$F289=\"\",O289=\"\",P289=\"\"),\"\",IF(AND(O289=$E289,P289=$F289),Reglement!$S$3*$J289,IF(SIGN($E289-$F289)=SIGN(O289-P289),Reglement!$S$4*$J289,0))*IF(AND($E289+$F289>=6,O289+P289>=6),Reglement!$S$29,IF(AND($E289+$F289>=4,O289+P289>=4),Reglement!$S$28,1)))","v":""}]
[null,null,{"$f":"Score!T128","v":"Leicester City"},{"$f":"Score!W128","v":"Aston Villa"},{"$f":"IF(Score!U128<>\"\",Score!U128,\"\")","v":""},{"$f":"IF(Score!V128<>\"\",Score!V128,\"\")","v":""},1,1,1,"",{"$f":"IF($K$4<>0,HLOOKUP($K$4,$O$4:$XFD290,ROW()-3,FALSE),\"\")","v":""},{"$f":"IF($K$4<>0,HLOOKUP(CONCATENATE($K$4,\"1\"),$O$4:$XFD290,ROW()-3,FALSE),\"\")","v":""},{"$f":"IF($K$4<>0,HLOOKUP(CONCATENATE($K$4,\"2\"),$O$4:$XFD290,ROW()-3,FALSE),\"\")","v":""},{"$nulls":3},{"$f":"IF(OR($E290=\"\",$F290=\"\",O290=\"\",P290=\"\"),\"\",IF(AND(O290=$E290,P290=$F290),Reglement!$S$3*$J290,IF(SIGN($E290-$F290)=SIGN(O290-P290),Reglement!$S$4*$J290,0))*IF(AND($E290+$F290>=6,O290+P290>=6),Reglement!$S$29,IF(AND($E290+$F290>=4,O290+P290>=4),Reglement!$S$28,1)))","v":""}]
[null,null,{"$f":"Score!T129","v":"Liverpool"},{"$f":"Score!W129","v":"Bournemouth"},{"$f":"IF(Score!U129<>\"\",Score!U129,\"\")","v":""},{"$f":"IF(Score!V129<>\"\",Score!V129,\"\")","v":""},1,1,1,"",{"$f":"IF($K$4<>0,HLOOKUP($K$4,$O$4:$XFD291,ROW()-3,FALSE),\"\")","v":""},{"$f":"IF($K$4<>0,HLOOKUP(CONCATENATE($K$4,\"1\"),$O$4:$XFD291,ROW()-3,FALSE),\"\")","v":""},{"$f":"IF($K$4<>0,HLOOKUP(CONCATENATE($K$4,\"2\"),$O$4:$XFD291,ROW()-3,FALSE),\"\")","v":""},{"$nulls":3},{"$f":"IF(OR($E291=\"\",$F291=\"\",O291=\"\",P291=\"\"),\"\",IF(AND(O291=$E291,P291=$F291),Reglement!$S$3*$J291,IF(SIGN($E291-$F291)=SIGN(O291-P291),Reglement!$S$4*$J291,0))*IF(AND($E291+$F291>=6,O291+P291>=6),Reglement!$S$29,IF(AND($E291+$F291>=4,O291+P291>=4),Reglement!$S$28,1)))","v":""}]
[null,null,{"$f":"Score!T130","v":"Manchester United"},{"$f":"Score!W130","v":"Manchester City"},{"$f":"IF(Score!U130<>\"\",Score!U130,\"\")","v":""},{"$f":"IF(Score!V130<>\"\",Score!V130,\"\")","v":""},1,1,1,"",{"$f":"IF($K$4<>0,HLOOKUP($K$4,$O$4:$XFD292,ROW()-3,FALSE),\"\")","v":""},{"$f":"IF($K$4<>0,HLOOKUP(CONCATENATE($K$4,\"1\"),$O$4:$XFD292,ROW()-3,FALSE),\"\")","v":""},{"$f":"IF($K$4<>0,HLOOKUP(CONCATENATE($K$4,\"2\"),$O$4:$XFD292,ROW()-3,FALSE),\"\")","v":""},{"$nulls":3},{"$f":"IF(OR($E292=\"\",$F292=\"\",O292=\"\",P292=\"\"),\"\",IF(AND(O292=$E292,P292=$F292),Reglement!$S$3*$J292,IF(SIGN($E292-$F292)=SIGN(O292-P292),Reglement!$S$4*$J292,0))*IF(AND($E292+$F292>=6,O292+P292>=6),Reglement!$S$29,IF(AND($E292+$F292>=4,O292+P292>=4),Reglement!$S$28,1)))","v":""}]
[null,null,{"$f":"Score!T131","v":"Sheffield United"},{"$f":"Score!W131","v":"Norwich"},{"$f":"IF(Score!U131<>\"\",Score!U131,\"\")","v":""},{"$f":"IF(Score!V131<>\"\",Score!V131,\"\")","v":""},1,1,1,"",{"$f":"IF($K$4<>0,HLOOKUP($K$4,$O$4:$XFD293,ROW()-3,FALSE),\"\")","v":""},{"$f":"IF($K$4<>0,HLOOKUP(CONCATENATE($K$4,\"1\"),$O$4:$XFD293,ROW()-3,FALSE),\"\")","v":""},{"$f":"IF($K$4<>0,HLOOKUP(CONCATENATE($K$4,\"2\"),$O$4:$XFD293,ROW()-3,FALSE),\"\")","v":""},{"$nulls":3},{"$f":"IF(OR($E293=\"\",$F293=\"\",O293=\"\",P293=\"\"),\"\",IF(AND(O293=$E293,P293=$F293),Reglement!$S$3*$J293,IF(SIGN($E293-$F293)=SIGN(O293-P293),Reglement!$S$4*$J293,0))*IF(AND($E293+$F293>=6,O293+P293>=6),Reglement!$S$29,IF(AND($E293+$F293>=4,O293+P293>=4),Reglement!$S$28,1)))","v":""}]
[null,null,{"$f":"Score!T132","v":"Southampton"},{"$f":"Score!W132","v":"Newcastle"},{"$f":"IF(Score!U132<>\"\",Score!U132,\"\")","v":""},{"$f":"IF(Score!V132<>\"\",Score!V132,\"\")","v":""},1,1,1,"",{"$f":"IF($K$4<>0,HLOOKUP($K$4,$O$4:$XFD294,ROW()-3,FALSE),\"\")","v":""},{"$f":"IF($K$4<>0,HLOOKUP(CONCATENATE($K$4,\"1\"),$O$4:$XFD294,ROW()-3,FALSE),\"\")","v":""},{"$f":"IF($K$4<>0,HLOOKUP(CONCATENATE($K$4,\"2\"),$O$4:$XFD294,ROW()-3,FALSE),\"\")","v":""},{"$nulls":3},{"$f":"IF(OR($E294=\"\",$F294=\"\",O294=\"\",P294=\"\"),\"\",IF(AND(O294=$E294,P294=$F294),Reglement!$S$3*$J294,IF(SIGN($E294-$F294)=SIGN(O294-P294),Reglement!$S$4*$J294,0))*IF(AND($E294+$F294>=6,O294+P294>=6),Reglement!$S$29,IF(AND($E294+$F294>=4,O294+P294>=4),Reglement!$S$28,1)))","v":""}]
[null,null,{"$f":"Score!T133","v":"Wolverhampton"},{"$f":"Score!W133","v":"Brighton"},{"$f":"IF(Score!U133<>\"\",Score!U133,\"\")","v":""},{"$f":"IF(Score!V133<>\"\",Score!V133,\"\")","v":""},1,1,1,"",{"$f":"IF($K$4<>0,HLOOKUP($K$4,$O$4:$XFD295,ROW()-3,FALSE),\"\")","v":""},{"$f":"IF($K$4<>0,HLOOKUP(CONCATENATE($K$4,\"1\"),$O$4:$XFD295,ROW()-3,FALSE),\"\")","v":""},{"$f":"IF($K$4<>0,HLOOKUP(CONCATENATE($K$4,\"2\"),$O$4:$XFD295,ROW()-3,FALSE),\"\")","v":""},{"$nulls":3},{"$f":"IF(OR($E295=\"\",$F295=\"\",O295=\"\",P295=\"\"),\"\",IF(AND(O295=$E295,P295=$F295),Reglement!$S$3*$J295,IF(SIGN($E295-$F295)=SIGN(O295-P295),Reglement!$S$4*$J295,0))*IF(AND($E295+$F295>=6,O295+P295>=6),Reglement!$S$29,IF(AND($E295+$F295>=4,O295+P295>=4),Reglement!$S$28,1)))","v":""}]
["JOURNEE n°30",null,{"$f":"Score!T137","v":"Bournemouth"},{"$f":"Score!W137","v":"Crystal Palace"},{"$f":"IF(Score!U137<>\"\",Score!U137,\"\")","v":""},{"$f":"IF(Score!V137<>\"\",Score!V137,\"\")","v":""},1,1,1,"",{"$f":"IF($K$4<>0,HLOOKUP($K$4,$O$4:$XFD296,ROW()-3,FALSE),\"\")","v":""},{"$f":"IF($K$4<>0,HLOOKUP(CONCATENATE($K$4,\"1\"),$O$4:$XFD296,ROW()-3,FALSE),\"\")","v":""},{"$f":"IF($K$4<>0,HLOOKUP(CONCATENATE($K$4,\"2\"),$O$4:$XFD296,ROW()-3,FALSE),\"\")","v":""},{"$nulls":3},{"$f":"IF(OR($E296=\"\",$F296=\"\",O296=\"\",P296=\"\"),\"\",IF(AND(O296=$E296,P296=$F296),Reglement!$S$3*$J296,IF(SIGN($E296-$F296)=SIGN(O296-P296),Reglement!$S$4*$J296,0))*IF(AND($E296+$F296>=6,O296+P296>=6),Reglement!$S$29,IF(AND($E296+$F296>=4,O296+P296>=4),Reglement!$S$28,1)))","v":""}]
[null,null,{"$f":"Score!T138","v":"Aston Villa"},{"$f":"Score!W138","v":"Chelsea"},{"$f":"IF(Score!U138<>\"\",Score!U138,\"\")","v":""},{"$f":"IF(Score!V138<>\"\",Score!V138,\"\")","v":""},1,1,1,"",{"$f":"IF($K$4<>0,HLOOKUP($K$4,$O$4:$XFD297,ROW()-3,FALSE),\"\")","v":""},{"$f":"IF($K$4<>0,HLOOKUP(CONCATENATE($K$4,\"1\"),$O$4:$XFD297,ROW()-3,FALSE),\"\")","v":""},{"$f":"IF($K$4<>0,HLOOKUP(CONCATENATE($K$4,\"2\"),$O$4:$XFD297,ROW()-3,FALSE),\"\")","v":""},{"$nulls":3},{"$f":"IF(OR($E297=\"\",$F297=\"\",O297=\"\",P297=\"\"),\"\",IF(AND(O297=$E297,P297=$F297),Reglement!$S$3*$J297,IF(SIGN($E297-$F297)=SIGN(O297-P297),Reglement!$S$4*$J297,0))*IF(AND($E297+$F297>=6,O297+P297>=6),Reglement!$S$29,IF(AND($E297+$F297>=4,O297+P297>=4),Reglement!$S$28,1)))","v":""}]
[null,null,{"$f":"Score!T139","v":"Brighton"},{"$f":"Score!W139","v":"Arsenal"},{"$f":"IF(Score!U139<>\"\",Score!U139,\"\")","v":""},{"$f":"IF(Score!V139<>\"\",Score!V139,\"\")","v":""},1,1,1,"",{"$f":"IF($K$4<>0,HLOOKUP($K$4,$O$4:$XFD298,ROW()-3,FALSE),\"\")","v":""},{"$f":"IF($K$4<>0,HLOOKUP(CONCATENATE($K$4,\"1\"),$O$4:$XFD298,ROW()-3,FALSE),\"\")","v":""},{"$f":"IF($K$4<>0,HLOOKUP(CONCATENATE($K$4,\"2\"),$O$4:$XFD298,ROW()-3,FALSE),\"\")","v":""},{"$nulls":3},{"$f":"IF(OR($E298=\"\",$F298=\"\",O298=\"\",P298=\"\"),\"\",IF(AND(O298=$E298,P298=$F298),Reglement!$S$3*$J298,IF(SIGN($E298-$F298)=SIGN(O298-P298),Reglement!$S$4*$J298,0))*IF(AND($E298+$F298>=6,O298+P298>=6),Reglement!$S$29,IF(AND($E298+$F298>=4,O298+P298>=4),Reglement!$S$28,1)))","v":""}]
[null,null,{"$f":"Score!T140","v":"Everton"},{"$f":"Score!W140","v":"Liverpool"},{"$f":"IF(Score!U140<>\"\",Score!U140,\"\")","v":""},{"$f":"IF(Score!V140<>\"\",Score!V140,\"\")","v":""},1,1,1,"",{"$f":"IF($K$4<>0,HLOOKUP($K$4,$O$4:$XFD299,ROW()-3,FALSE),\"\")","v":""},{"$f":"IF($K$4<>0,HLOOKUP(CONCATENATE($K$4,\"1\"),$O$4:$XFD299,ROW()-3,FALSE),\"\")","v":""},{"$f":"IF($K$4<>0,HLOOKUP(CONCATENATE($K$4,\"2\"),$O$4:$XFD299,ROW()-3,FALSE),\"\")","v":""},{"$nulls":3},{"$f":"IF(OR($E299=\"\",$F299=\"\",O299=\"\",P299=\"\"),\"\",IF(AND(O299=$E299,P299=$F299),Reglement!$S$3*$J299,IF(SIGN($E299-$F299)=SIGN(O299-P299),Reglement!$S$4*$J299,0))*IF(AND($E299+$F299>=6,O299+P299>=6),Reglement!$S$29,IF(AND($E299+$F299>=4,O299+P299>=4),Reglement!$S$28,1)))","v":""}]
[null,null,{"$f":"Score!T141","v":"Manchester City"},{"$f":"Score!W141","v":"Burnley"},{"$f":"IF(Score!U141<>\"\",Score!U141,\"\")","v":""},{"$f":"IF(Score!V141<>\"\",Score!V141,\"\")","v":""},1,1,1,"",{"$f":"IF($K$4<>0,HLOOKUP($K$4,$O$4:$XFD300,ROW()-3,FALSE),\"\")","v":""},{"$f":"IF($K$4<>0,HLOOKUP(CONCATENATE($K$4,\"1\"),$O$4:$XFD300,ROW()-3,FALSE),\"\")","v":""},{"$f":"IF($K$4<>0,HLOOKUP(CONCATENATE($K$4,\"2\"),$O$4:$XFD300,ROW()-3,FALSE),\"\")","v":""},{"$nulls":3},{"$f":"IF(OR($E300=\"\",$F300=\"\",O300=\"\",P300=\"\"),\"\",IF(AND(O300=$E300,P300=$F300),Reglement!$S$3*$J300,IF(SIGN($E300-$F300)=SIGN(O300-P300),Reglement!$S$4*$J300,0))*IF(AND($E300+$F300>=6,O300+P300>=6),Reglement!$S$29,IF(AND($E300+$F300>=4,O300+P300>=4),Reglement!$S$28,1)))","v":""}]
[null,null,{"$f":"Score!T142","v":"Newcastle"},{"$f":"Score!W142","v":"Sheffield United"},{"$f":"IF(Score!U142<>\"\",Score!U142,\"\")","v":""},{"$f":"IF(Score!V142<>\"\",Score!V142,\"\")","v":""},1,1,1,"",{"$f":"IF($K$4<>0,HLOOKUP($K$4,$O$4:$XFD301,ROW()-3,FALSE),\"\")","v":""},{"$f":"IF($K$4<>0,HLOOKUP(CONCATENATE($K$4,\"1\"),$O$4:$XFD301,ROW()-3,FALSE),\"\")","v":""},{"$f":"IF($K$4<>0,HLOOKUP(CONCATENATE($K$4,\"2\"),$O$4:$XFD301,ROW()-3,FALSE),\"\")","v":""},{"$nulls":3},{"$f":"IF(OR($E301=\"\",$F301=\"\",O301=\"\",P301=\"\"),\"\",IF(AND(O301=$E301,P301=$F301),Reglement!$S$3*$J301,IF(SIGN($E301-$F301)=SIGN(O301-P301),Reglement!$S$4*$J301,0))*IF(AND($E301+$F301>=6,O301+P301>=6),Reglement!$S$29,IF(AND($E301+$F301>=4,O301+P301>=4),Reglement!$S$28,1)))","v":""}]
[null,null,{"$f":"Score!T143","v":"Norwich"},{"$f":"Score!W143","v":"Southampton"},{"$f":"IF(Score!U143<>\"\",Score!U143,\"\")","v":""},{"$f":"IF(Score!V143<>\"\",Score!V143,\"\")","v":""},1,1,1,"",{"$f":"IF($K$4<>0,HLOOKUP($K$4,$O$4:$XFD302,ROW()-3,FALSE),\"\")","v":""},{"$f":"IF($K$4<>0,HLOOKUP(CONCATENATE($K$4,\"1\"),$O$4:$XFD302,ROW()-3,FALSE),\"\")","v":""},{"$f":"IF($K$4<>0,HLOOKUP(CONCATENATE($K$4,\"2\"),$O$4:$XFD302,ROW()-3,FALSE),\"\")","v":""},{"$nulls":3},{"$f":"IF(OR($E302=\"\",$F302=\"\",O302=\"\",P302=\"\"),\"\",IF(AND(O302=$E302,P302=$F302),Reglement!$S$3*$J302,IF(SIGN($E302-$F302)=SIGN(O302-P302),Reglement!$S$4*$J302,0))*IF(AND($E302+$F302>=6,O302+P302>=6),Reglement!$S$29,IF(AND($E302+$F302>=4,O302+P302>=4),Reglement!$S$28,1)))","v":""}]
[null,null,{"$f":"Score!T144","v":"Tottenham"},{"$f":"Score!W144","v":"Manchester United"},{"$f":"IF(Score!U144<>\"\",Score!U144,\"\")","v":""},{"$f":"IF(Score!V144<>\"\",Score!V144,\"\")","v":""},1,1,1,"",{"$f":"IF($K$4<>0,HLOOKUP($K$4,$O$4:$XFD303,ROW()-3,FALSE),\"\")","v":""},{"$f":"IF($K$4<>0,HLOOKUP(CONCATENATE($K$4,\"1\"),$O$4:$XFD303,ROW()-3,FALSE),\"\")","v":""},{"$f":"IF($K$4<>0,HLOOKUP(CONCATENATE($K$4,\"2\"),$O$4:$XFD303,ROW()-3,FALSE),\"\")","v":""},{"$nulls":3},{"$f":"IF(OR($E303=\"\",$F303=\"\",O303=\"\",P303=\"\"),\"\",IF(AND(O303=$E303,P303=$F303),Reglement!$S$3*$J303,IF(SIGN($E303-$F303)=SIGN(O303-P303),Reglement!$S$4*$J303,0))*IF(AND($E303+$F303>=6,O303+P303>=6),Reglement!$S$29,IF(AND($E303+$F303>=4,O303+P303>=4),Reglement!$S$28,1)))","v":""}]
[null,null,{"$f":"Score!T145","v":"Watford"},{"$f":"Score!W145","v":"Leicester City"},{"$f":"IF(Score!U145<>\"\",Score!U145,\"\")","v":""},{"$f":"IF(Score!V145<>\"\",Score!V145,\"\")","v":""},1,1,1,"",{"$f":"IF($K$4<>0,HLOOKUP($K$4,$O$4:$XFD304,ROW()-3,FALSE),\"\")","v":""},{"$f":"IF($K$4<>0,HLOOKUP(CONCATENATE($K$4,\"1\"),$O$4:$XFD304,ROW()-3,FALSE),\"\")","v":""},{"$f":"IF($K$4<>0,HLOOKUP(CONCATENATE($K$4,\"2\"),$O$4:$XFD304,ROW()-3,FALSE),\"\")","v":""},{"$nulls":3},{"$f":"IF(OR($E304=\"\",$F304=\"\",O304=\"\",P304=\"\"),\"\",IF(AND(O304=$E304,P304=$F304),Reglement!$S$3*$J304,IF(SIGN($E304-$F304)=SIGN(O304-P304),Reglement!$S$4*$J304,0))*IF(AND($E304+$F304>=6,O304+P304>=6),Reglement!$S$29,IF(AND($E304+$F304>=4,O304+P304>=4),Reglement!$S$28,1)))","v":""}]
[null,null,{"$f":"Score!T146","v":"West Ham"},{"$f":"Score!W146","v":"Wolverhampton"},{"$f":"IF(Score!U146<>\"\",Score!U146,\"\")","v":""},{"$f":"IF(Score!V146<>\"\",Score!V146,\"\")","v":""},1,1,1,"",{"$f":"IF($K$4<>0,HLOOKUP($K$4,$O$4:$XFD305,ROW()-3,FALSE),\"\")","v":""},{"$f":"IF($K$4<>0,HLOOKUP(CONCATENATE($K$4,\"1\"),$O$4:$XFD305,ROW()-3,FALSE),\"\")","v":""},{"$f":"IF($K$4<>0,HLOOKUP(CONCATENATE($K$4,\"2\"),$O$4:$XFD305,ROW()-3,FALSE),\"\")","v":""},{"$nulls":3},{"$f":"IF(OR($E305=\"\",$F305=\"\",O305=\"\",P305=\"\"),\"\",IF(AND(O305=$E305,P305=$F305),Reglement!$S$3*$J305,IF(SIGN($E305-$F305)=SIGN(O305-P305),Reglement!$S$4*$J305,0))*IF(AND($E305+$F305>=6,O305+P305>=6),Reglement!$S$29,IF(AND($E305+$F305>=4,O305+P305>=4),Reglement!$S$28,1)))","v":""}]
["JOURNEE n°31",null,{"$f":"Score!T150","v":"Burnley"},{"$f":"Score!W150","v":"Watford"},{"$f":"IF(Score!U150<>\"\",Score!U150,\"\")","v":""},{"$f":"IF(Score!V150<>\"\",Score!V150,\"\")","v":""},1,1,1,"",{"$f":"IF($K$4<>0,HLOOKUP($K$4,$O$4:$XFD306,ROW()-3,FALSE),\"\")","v":""},{"$f":"IF($K$4<>0,HLOOKUP(CONCATENATE($K$4,\"1\"),$O$4:$XFD306,ROW()-3,FALSE),\"\")","v":""},{"$f":"IF($K$4<>0,HLOOKUP(CONCATENATE($K$4,\"2\"),$O$4:$XFD306,ROW()-3,FALSE),\"\")","v":""},{"$nulls":3},{"$f":"IF(OR($E306=\"\",$F306=\"\",O306=\"\",P306=\"\"),\"\",IF(AND(O306=$E306,P306=$F306),Reglement!$S$3*$J306,IF(SIGN($E306-$F306)=SIGN(O306-P306),Reglement!$S$4*$J306,0))*IF(AND($E306+$F306>=6,O306+P306>=6),Reglement!$S$29,IF(AND($E306+$F306>=4,O306+P306>=4),Reglement!$S$28,1)))","v":""}]
[null,null,{"$f":"Score!T151","v":"Chelsea"},{"$f":"Score!W151","v":"Manchester City"},{"$f":"IF(Score!U151<>\"\",Score!U151,\"\")","v":""},{"$f":"IF(Score!V151<>\"\",Score!V151,\"\")","v":""},1,1,1,{"$f":"IF(OR(E307=\"\",F307=\"\"),\"\",IF(E307>F307,G307,IF(E307=F307,H307,I307)))","v":""},{"$f":"IF($K$4<>0,HLOOKUP($K$4,$O$4:$XFD307,ROW()-3,FALSE),\"\")","v":""},{"$f":"IF($K$4<>0,HLOOKUP(CONCATENATE($K$4,\"1\"),$O$4:$XFD307,ROW()-3,FALSE),\"\")","v":""},{"$f":"IF($K$4<>0,HLOOKUP(CONCATENATE($K$4,\"2\"),$O$4:$XFD307,ROW()-3,FALSE),\"\")","v":""},{"$nulls":3},{"$f":"IF(OR($E307=\"\",$F307=\"\",O307=\"\",P307=\"\"),\"\",IF(AND(O307=$E307,P307=$F307),Reglement!$S$3*$J307,IF(SIGN($E307-$F307)=SIGN(O307-P307),Reglement!$S$4*$J307,0))*IF(AND($E307+$F307>=6,O307+P307>=6),Reglement!$S$29,IF(AND($E307+$F307>=4,O307+P307>=4),Reglement!$S$28,1)))","v":""}]
[null,null,{"$f":"Score!T152","v":"Leicester City"},{"$f":"Score!W152","v":"Brighton"},{"$f":"IF(Score!U152<>\"\",Score!U152,\"\")","v":""},{"$f":"IF(Score!V152<>\"\",Score!V152,\"\")","v":""},1,1,1,"",{"$f":"IF($K$4<>0,HLOOKUP($K$4,$O$4:$XFD308,ROW()-3,FALSE),\"\")","v":""},{"$f":"IF($K$4<>0,HLOOKUP(CONCATENATE($K$4,\"1\"),$O$4:$XFD308,ROW()-3,FALSE),\"\")","v":""},{"$f":"IF($K$4<>0,HLOOKUP(CONCATENATE($K$4,\"2\"),$O$4:$XFD308,ROW()-3,FALSE),\"\")","v":""},{"$nulls":3},{"$f":"IF(OR($E308=\"\",$F308=\"\",O308=\"\",P308=\"\"),\"\",IF(AND(O308=$E308,P308=$F308),Reglement!$S$3*$J308,IF(SIGN($E308-$F308)=SIGN(O308-P308),Reglement!$S$4*$J308,0))*IF(AND($E308+$F308>=6,O308+P308>=6),Reglement!$S$29,IF(AND($E308+$F308>=4,O308+P308>=4),Reglement!$S$28,1)))","v":""}]
[null,null,{"$f":"Score!T153","v":"Liverpool"},{"$f":"Score!W153","v":"Crystal Palace"},{"$f":"IF(Score!U153<>\"\",Score!U153,\"\")","v":""},{"$f":"IF(Score!V153<>\"\",Score!V153,\"\")","v":""},1,1,1,"",{"$f":"IF($K$4<>0,HLOOKUP($K$4,$O$4:$XFD309,ROW()-3,FALSE),\"\")","v":""},{"$f":"IF($K$4<>0,HLOOKUP(CONCATENATE($K$4,\"1\"),$O$4:$XFD309,ROW()-3,FALSE),\"\")","v":""},{"$f":"IF($K$4<>0,HLOOKUP(CONCATENATE($K$4,\"2\"),$O$4:$XFD309,ROW()-3,FALSE),\"\")","v":""},{"$nulls":3},{"$f":"IF(OR($E309=\"\",$F309=\"\",O309=\"\",P309=\"\"),\"\",IF(AND(O309=$E309,P309=$F309),Reglement!$S$3*$J309,IF(SIGN($E309-$F309)=SIGN(O309-P309),Reglement!$S$4*$J309,0))*IF(AND($E309+$F309>=6,O309+P309>=6),Reglement!$S$29,IF(AND($E309+$F309>=4,O309+P309>=4),Reglement!$S$28,1)))","v":""}]
[null,null,{"$f":"Score!T154","v":"Manchester United"},{"$f":"Score!W154","v":"Sheffield United"},{"$f":"IF(Score!U154<>\"\",Score!U154,\"\")","v":""},{"$f":"IF(Score!V154<>\"\",Score!V154,\"\")","v":""},1,1,1,"",{"$f":"IF($K$4<>0,HLOOKUP($K$4,$O$4:$XFD310,ROW()-3,FALSE),\"\")","v":""},{"$f":"IF($K$4<>0,HLOOKUP(CONCATENATE($K$4,\"1\"),$O$4:$XFD310,ROW()-3,FALSE),\"\")","v":""},{"$f":"IF($K$4<>0,HLOOKUP(CONCATENATE($K$4,\"2\"),$O$4:$XFD310,ROW()-3,FALSE),\"\")","v":""},{"$nulls":3},{"$f":"IF(OR($E310=\"\",$F310=\"\",O310=\"\",P310=\"\"),\"\",IF(AND(O310=$E310,P310=$F310),Reglement!$S$3*$J310,IF(SIGN($E310-$F310)=SIGN(O310-P310),Reglement!$S$4*$J310,0))*IF(AND($E310+$F310>=6,O310+P310>=6),Reglement!$S$29,IF(AND($E310+$F310>=4,O310+P310>=4),Reglement!$S$28,1)))","v":""}]
[null,null,{"$f":"Score!T155","v":"Newcastle"},{"$f":"Score!W155","v":"Aston Villa"},{"$f":"IF(Score!U155<>\"\",Score!U155,\"\")","v":""},{"$f":"IF(Score!V155<>\"\",Score!V155,\"\")","v":""},1,1,1,"",{"$f":"IF($K$4<>0,HLOOKUP($K$4,$O$4:$XFD311,ROW()-3,FALSE),\"\")","v":""},{"$f":"IF($K$4<>0,HLOOKUP(CONCATENATE($K$4,\"1\"),$O$4:$XFD311,ROW()-3,FALSE),\"\")","v":""},{"$f":"IF($K$4<>0,HLOOKUP(CONCATENATE($K$4,\"2\"),$O$4:$XFD311,ROW()-3,FALSE),\"\")","v":""},{"$nulls":3},{"$f":"IF(OR($E311=\"\",$F311=\"\",O311=\"\",P311=\"\"),\"\",IF(AND(O311=$E311,P311=$F311),Reglement!$S$3*$J311,IF(SIGN($E311-$F311)=SIGN(O311-P311),Reglement!$S$4*$J311,0))*IF(AND($E311+$F311>=6,O311+P311>=6),Reglement!$S$29,IF(AND($E311+$F311>=4,O311+P311>=4),Reglement!$S$28,1)))","v":""}]
[null,null,{"$f":"Score!T156","v":"Norwich"},{"$f":"Score!W156","v":"Everton"},{"$f":"IF(Score!U156<>\"\",Score!U156,\"\")","v":""},{"$f":"IF(Score!V156<>\"\",Score!V156,\"\")","v":""},1,1,1,"",{"$f":"IF($K$4<>0,HLOOKUP($K$4,$O$4:$XFD312,ROW()-3,FALSE),\"\")","v":""},{"$f":"IF($K$4<>0,HLOOKUP(CONCATENATE($K$4,\"1\"),$O$4:$XFD312,ROW()-3,FALSE),\"\")","v":""},{"$f":"IF($K$4<>0,HLOOKUP(CONCATENATE($K$4,\"2\"),$O$4:$XFD312,ROW()-3,FALSE),\"\")","v":""},{"$nulls":3},{"$f":"IF(OR($E312=\"\",$F312=\"\",O312=\"\",P312=\"\"),\"\",IF(AND(O312=$E312,P312=$F312),Reglement!$S$3*$J312,IF(SIGN($E312-$F312)=SIGN(O312-P312),Reglement!$S$4*$J312,0))*IF(AND($E312+$F312>=6,O312+P312>=6),Reglement!$S$29,IF(AND($E312+$F312>=4,O312+P312>=4),Reglement!$S$28,1)))","v":""}]
[null,null,{"$f":"Score!T157","v":"Southampton"},{"$f":"Score!W157","v":"Arsenal"},{"$f":"IF(Score!U157<>\"\",Score!U157,\"\")","v":""},{"$f":"IF(Score!V157<>\"\",Score!V157,\"\")","v":""},1,1,1,{"$f":"IF(OR(E313=\"\",F313=\"\"),\"\",IF(E313>F313,G313,IF(E313=F313,H313,I313)))","v":""},{"$f":"IF($K$4<>0,HLOOKUP($K$4,$O$4:$XFD313,ROW()-3,FALSE),\"\")","v":""},{"$f":"IF($K$4<>0,HLOOKUP(CONCATENATE($K$4,\"1\"),$O$4:$XFD313,ROW()-3,FALSE),\"\")","v":""},{"$f":"IF($K$4<>0,HLOOKUP(CONCATENATE($K$4,\"2\"),$O$4:$XFD313,ROW()-3,FALSE),\"\")","v":""},{"$nulls":3},{"$f":"IF(OR($E313=\"\",$F313=\"\",O313=\"\",P313=\"\"),\"\",IF(AND(O313=$E313,P313=$F313),Reglement!$S$3*$J313,IF(SIGN($E313-$F313)=SIGN(O313-P313),Reglement!$S$4*$J313,0))*IF(AND($E313+$F313>=6,O313+P313>=6),Reglement!$S$29,IF(AND($E313+$F313>=4,O313+P313>=4),Reglement!$S$28,1)))","v":""}]
[null,null,{"$f":"Score!T158","v":"Tottenham"},{"$f":"Score!W158","v":"West Ham"},{"$f":"IF(Score!U158<>\"\",Score!U158,\"\")","v":""},{"$f":"IF(Score!V158<>\"\",Score!V158,\"\")","v":""},1,1,1,"",{"$f":"IF($K$4<>0,HLOOKUP($K$4,$O$4:$XFD314,ROW()-3,FALSE),\"\")","v":""},{"$f":"IF($K$4<>0,HLOOKUP(CONCATENATE($K$4,\"1\"),$O$4:$XFD314,ROW()-3,FALSE),\"\")","v":""},{"$f":"IF($K$4<>0,HLOOKUP(CONCATENATE($K$4,\"2\"),$O$4:$XFD314,ROW()-3,FALSE),\"\")","v":""},{"$nulls":3},{"$f":"IF(OR($E314=\"\",$F314=\"\",O314=\"\",P314=\"\"),\"\",IF(AND(O314=$E314,P314=$F314),Reglement!$S$3*$J314,IF(SIGN($E314-$F314)=SIGN(O314-P314),Reglement!$S$4*$J314,0))*IF(AND($E314+$F314>=6,O314+P314>=6),Reglement!$S$29,IF(AND($E314+$F314>=4,O314+P314>=4),Reglement!$S$28,1)))","v":""}]
[null,null,{"$f":"Score!T159","v":"Wolverhampton"},{"$f":"Score!W159","v":"Bournemouth"},{"$f":"IF(Score!U159<>\"\",Score!U159,\"\")","v":""},{"$f":"IF(Score!V159<>\"\",Score!V159,\"\")","v":""},1,1,1,"",{"$f":"IF($K$4<>0,HLOOKUP($K$4,$O$4:$XFD315,ROW()-3,FALSE),\"\")","v":""},{"$f":"IF($K$4<>0,HLOOKUP(CONCATENATE($K$4,\"1\"),$O$4:$XFD315,ROW()-3,FALSE),\"\")","v":""},{"$f":"IF($K$4<>0,HLOOKUP(CONCATENATE($K$4,\"2\"),$O$4:$XFD315,ROW()-3,FALSE),\"\")","v":""},{"$nulls":3},{"$f":"IF(OR($E315=\"\",$F315=\"\",O315=\"\",P315=\"\"),\"\",IF(AND(O315=$E315,P315=$F315),Reglement!$S$3*$J315,IF(SIGN($E315-$F315)=SIGN(O315-P315),Reglement!$S$4*$J315,0))*IF(AND($E315+$F315>=6,O315+P315>=6),Reglement!$S$29,IF(AND($E315+$F315>=4,O315+P315>=4),Reglement!$S$28,1)))","v":""}]
["JOURNEE n°32",null,{"$f":"Score!T163","v":"Bournemouth"},{"$f":"Score!W163","v":"Newcastle"},{"$f":"IF(Score!U163<>\"\",Score!U163,\"\")","v":""},{"$f":"IF(Score!V163<>\"\",Score!V163,\"\")","v":""},1,1,1,"",{"$f":"IF($K$4<>0,HLOOKUP($K$4,$O$4:$XFD316,ROW()-3,FALSE),\"\")","v":""},{"$f":"IF($K$4<>0,HLOOKUP(CONCATENATE($K$4,\"1\"),$O$4:$XFD316,ROW()-3,FALSE),\"\")","v":""},{"$f":"IF($K$4<>0,HLOOKUP(CONCATENATE($K$4,\"2\"),$O$4:$XFD316,ROW()-3,FALSE),\"\")","v":""},{"$nulls":3},{"$f":"IF(OR($E316=\"\",$F316=\"\",O316=\"\",P316=\"\"),\"\",IF(AND(O316=$E316,P316=$F316),Reglement!$S$3*$J316,IF(SIGN($E316-$F316)=SIGN(O316-P316),Reglement!$S$4*$J316,0))*IF(AND($E316+$F316>=6,O316+P316>=6),Reglement!$S$29,IF(AND($E316+$F316>=4,O316+P316>=4),Reglement!$S$28,1)))","v":""}]
[null,null,{"$f":"Score!T164","v":"Arsenal"},{"$f":"Score!W164","v":"Norwich"},{"$f":"IF(Score!U164<>\"\",Score!U164,\"\")","v":""},{"$f":"IF(Score!V164<>\"\",Score!V164,\"\")","v":""},1,1,1,"",{"$f":"IF($K$4<>0,HLOOKUP($K$4,$O$4:$XFD317,ROW()-3,FALSE),\"\")","v":""},{"$f":"IF($K$4<>0,HLOOKUP(CONCATENATE($K$4,\"1\"),$O$4:$XFD317,ROW()-3,FALSE),\"\")","v":""},{"$f":"IF($K$4<>0,HLOOKUP(CONCATENATE($K$4,\"2\"),$O$4:$XFD317,ROW()-3,FALSE),\"\")","v":""},{"$nulls":3},{"$f":"IF(OR($E317=\"\",$F317=\"\",O317=\"\",P317=\"\"),\"\",IF(AND(O317=$E317,P317=$F317),Reglement!$S$3*$J317,IF(SIGN($E317-$F317)=SIGN(O317-P317),Reglement!$S$4*$J317,0))*IF(AND($E317+$F317>=6,O317+P317>=6),Reglement!$S$29,IF(AND($E317+$F317>=4,O317+P317>=4),Reglement!$S$28,1)))","v":""}]
[null,null,{"$f":"Score!T165","v":"Aston Villa"},{"$f":"Score!W165","v":"Wolverhampton"},{"$f":"IF(Score!U165<>\"\",Score!U165,\"\")","v":""},{"$f":"IF(Score!V165<>\"\",Score!V165,\"\")","v":""},1,1,1,"",{"$f":"IF($K$4<>0,HLOOKUP($K$4,$O$4:$XFD318,ROW()-3,FALSE),\"\")","v":""},{"$f":"IF($K$4<>0,HLOOKUP(CONCATENATE($K$4,\"1\"),$O$4:$XFD318,ROW()-3,FALSE),\"\")","v":""},{"$f":"IF($K$4<>0,HLOOKUP(CONCATENATE($K$4,\"2\"),$O$4:$XFD318,ROW()-3,FALSE),\"\")","v":""},{"$nulls":3},{"$f":"IF(OR($E318=\"\",$F318=\"\",O318=\"\",P318=\"\"),\"\",IF(AND(O318=$E318,P318=$F318),Reglement!$S$3*$J318,IF(SIGN($E318-$F318)=SIGN(O318-P318),Reglement!$S$4*$J318,0))*IF(AND($E318+$F318>=6,O318+P318>=6),Reglement!$S$29,IF(AND($E318+$F318>=4,O318+P318>=4),Reglement!$S$28,1)))","v":""}]
[null,null,{"$f":"Score!T166","v":"Brighton"},{"$f":"Score!W166","v":"Manchester United"},{"$f":"IF(Score!U166<>\"\",Score!U166,\"\")","v":""},{"$f":"IF(Score!V166<>\"\",Score!V166,\"\")","v":""},1,1,1,"",{"$f":"IF($K$4<>0,HLOOKUP($K$4,$O$4:$XFD319,ROW()-3,FALSE),\"\")","v":""},{"$f":"IF($K$4<>0,HLOOKUP(CONCATENATE($K$4,\"1\"),$O$4:$XFD319,ROW()-3,FALSE),\"\")","v":""},{"$f":"IF($K$4<>0,HLOOKUP(CONCATENATE($K$4,\"2\"),$O$4:$XFD319,ROW()-3,FALSE),\"\")","v":""},{"$nulls":3},{"$f":"IF(OR($E319=\"\",$F319=\"\",O319=\"\",P319=\"\"),\"\",IF(AND(O319=$E319,P319=$F319),Reglement!$S$3*$J319,IF(SIGN($E319-$F319)=SIGN(O319-P319),Reglement!$S$4*$J319,0))*IF(AND($E319+$F319>=6,O319+P319>=6),Reglement!$S$29,IF(AND($E319+$F319>=4,O319+P319>=4),Reglement!$S$28,1)))","v":""}]
[null,null,{"$f":"Score!T167","v":"Crystal Palace"},{"$f":"Score!W167","v":"Burnley"},{"$f":"IF(Score!U167<>\"\",Score!U167,\"\")","v":""},{"$f":"IF(Score!V167<>\"\",Score!V167,\"\")","v":""},1,1,1,"",{"$f":"IF($K$4<>0,HLOOKUP($K$4,$O$4:$XFD320,ROW()-3,FALSE),\"\")","v":""},{"$f":"IF($K$4<>0,HLOOKUP(CONCATENATE($K$4,\"1\"),$O$4:$XFD320,ROW()-3,FALSE),\"\")","v":""},{"$f":"IF($K$4<>0,HLOOKUP(CONCATENATE($K$4,\"2\"),$O$4:$XFD320,ROW()-3,FALSE),\"\")","v":""},{"$nulls":3},{"$f":"IF(OR($E320=\"\",$F320=\"\",O320=\"\",P320=\"\"),\"\",IF(AND(O320=$E320,P320=$F320),Reglement!$S$3*$J320,IF(SIGN($E320-$F320)=SIGN(O320-P320),Reglement!$S$4*$J320,0))*IF(AND($E320+$F320>=6,O320+P320>=6),Reglement!$S$29,IF(AND($E320+$F320>=4,O320+P320>=4),Reglement!$S$28,1)))","v":""}]
[null,null,{"$f":"Score!T168","v":"Everton"},{"$f":"Score!W168","v":"Leicester City"},{"$f":"IF(Score!U168<>\"\",Score!U168,\"\")","v":""},{"$f":"IF(Score!V168<>\"\",Score!V168,\"\")","v":""},1,1,1,"",{"$f":"IF($K$4<>0,HLOOKUP($K$4,$O$4:$XFD321,ROW()-3,FALSE),\"\")","v":""},{"$f":"IF($K$4<>0,HLOOKUP(CONCATENATE($K$4,\"1\"),$O$4:$XFD321,ROW()-3,FALSE),\"\")","v":""},{"$f":"IF($K$4<>0,HLOOKUP(CONCATENATE($K$4,\"2\"),$O$4:$XFD321,ROW()-3,FALSE),\"\")","v":""},{"$nulls":3},{"$f":"IF(OR($E321=\"\",$F321=\"\",O321=\"\",P321=\"\"),\"\",IF(AND(O321=$E321,P321=$F321),Reglement!$S$3*$J321,IF(SIGN($E321-$F321)=SIGN(O321-P321),Reglement!$S$4*$J321,0))*IF(AND($E321+$F321>=6,O321+P321>=6),Reglement!$S$29,IF(AND($E321+$F321>=4,O321+P321>=4),Reglement!$S$28,1)))","v":""}]
[null,null,{"$f":"Score!T169","v":"Manchester City"},{"$f":"Score!W169","v":"Liverpool"},{"$f":"IF(Score!U169<>\"\",Score!U169,\"\")","v":""},{"$f":"IF(Score!V169<>\"\",Score!V169,\"\")","v":""},1,1,1,"",{"$f":"IF($K$4<>0,HLOOKUP($K$4,$O$4:$XFD322,ROW()-3,FALSE),\"\")","v":""},{"$f":"IF($K$4<>0,HLOOKUP(CONCATENATE($K$4,\"1\"),$O$4:$XFD322,ROW()-3,FALSE),\"\")","v":""},{"$f":"IF($K$4<>0,HLOOKUP(CONCATENATE($K$4,\"2\"),$O$4:$XFD322,ROW()-3,FALSE),\"\")","v":""},{"$nulls":3},{"$f":"IF(OR($E322=\"\",$F322=\"\",O322=\"\",P322=\"\"),\"\",IF(AND(O322=$E322,P322=$F322),Reglement!$S$3*$J322,IF(SIGN($E322-$F322)=SIGN(O322-P322),Reglement!$S$4*$J322,0))*IF(AND($E322+$F322>=6,O322+P322>=6),Reglement!$S$29,IF(AND($E322+$F322>=4,O322+P322>=4),Reglement!$S$28,1)))","v":""}]
[null,null,{"$f":"Score!T170","v":"Sheffield United"},{"$f":"Score!W170","v":"Tottenham"},{"$f":"IF(Score!U170<>\"\",Score!U170,\"\")","v":""},{"$f":"IF(Score!V170<>\"\",Score!V170,\"\")","v":""},1,1,1,"",{"$f":"IF($K$4<>0,HLOOKUP($K$4,$O$4:$XFD323,ROW()-3,FALSE),\"\")","v":""},{"$f":"IF($K$4<>0,HLOOKUP(CONCATENATE($K$4,\"1\"),$O$4:$XFD323,ROW()-3,FALSE),\"\")","v":""},{"$f":"IF($K$4<>0,HLOOKUP(CONCATENATE($K$4,\"2\"),$O$4:$XFD323,ROW()-3,FALSE),\"\")","v":""},{"$nulls":3},{"$f":"IF(OR($E323=\"\",$F323=\"\",O323=\"\",P323=\"\"),\"\",IF(AND(O323=$E323,P323=$F323),Reglement!$S$3*$J323,IF(SIGN($E323-$F323)=SIGN(O323-P323),Reglement!$S$4*$J323,0))*IF(AND($E323+$F323>=6,O323+P323>=6),Reglement!$S$29,IF(AND($E323+$F323>=4,O323+P323>=4),Reglement!$S$28,1)))","v":""}]
[null,null,{"$f":"Score!T171","v":"Watford"},{"$f":"Score!W171","v":"Southampton"},{"$f":"IF(Score!U171<>\"\",Score!U171,\"\")","v":""},{"$f":"IF(Score!V171<>\"\",Score!V171,\"\")","v":""},1,1,1,"",{"$f":"IF($K$4<>0,HLOOKUP($K$4,$O$4:$XFD324,ROW()-3,FALSE),\"\")","v":""},{"$f":"IF($K$4<>0,HLOOKUP(CONCATENATE($K$4,\"1\"),$O$4:$XFD324,ROW()-3,FALSE),\"\")","v":""},{"$f":"IF($K$4<>0,HLOOKUP(CONCATENATE($K$4,\"2\"),$O$4:$XFD324,ROW()-3,FALSE),\"\")","v":""},{"$nulls":3},{"$f":"IF(OR($E324=\"\",$F324=\"\",O324=\"\",P324=\"\"),\"\",IF(AND(O324=$E324,P324=$F324),Reglement!$S$3*$J324,IF(SIGN($E324-$F324)=SIGN(O324-P324),Reglement!$S$4*$J324,0))*IF(AND($E324+$F324>=6,O324+P324>=6),Reglement!$S$29,IF(AND($E324+$F324>=4,O324+P324>=4),Reglement!$S$28,1)))","v":""}]
[null,null,{"$f":"Score!T172","v":"West Ham"},{"$f":"Score!W172","v":"Chelsea"},{"$f":"IF(Score!U172<>\"\",Score!U172,\"\")","v":""},{"$f":"IF(Score!V172<>\"\",Score!V172,\"\")","v":""},1,1,1,"",{"$f":"IF($K$4<>0,HLOOKUP($K$4,$O$4:$XFD325,ROW()-3,FALSE),\"\")","v":""},{"$f":"IF($K$4<>0,HLOOKUP(CONCATENATE($K$4,\"1\"),$O$4:$XFD325,ROW()-3,FALSE),\"\")","v":""},{"$f":"IF($K$4<>0,HLOOKUP(CONCATENATE($K$4,\"2\"),$O$4:$XFD325,ROW()-3,FALSE),\"\")","v":""},{"$nulls":3},{"$f":"IF(OR($E325=\"\",$F325=\"\",O325=\"\",P325=\"\"),\"\",IF(AND(O325=$E325,P325=$F325),Reglement!$S$3*$J325,IF(SIGN($E325-$F325)=SIGN(O325-P325),Reglement!$S$4*$J325,0))*IF(AND($E325+$F325>=6,O325+P325>=6),Reglement!$S$29,IF(AND($E325+$F325>=4,O325+P325>=4),Reglement!$S$28,1)))","v":""}]
["JOURNEE n°33",null,{"$f":"Score!T176","v":"Burnley"},{"$f":"Score!W176","v":"Sheffield United"},{"$f":"IF(Score!U176<>\"\",Score!U176,\"\")","v":""},{"$f":"IF(Score!V176<>\"\",Score!V176,\"\")","v":""},1,1,1,"",{"$f":"IF($K$4<>0,HLOOKUP($K$4,$O$4:$XFD326,ROW()-3,FALSE),\"\")","v":""},{"$f":"IF($K$4<>0,HLOOKUP(CONCATENATE($K$4,\"1\"),$O$4:$XFD326,ROW()-3,FALSE),\"\")","v":""},{"$f":"IF($K$4<>0,HLOOKUP(CONCATENATE($K$4,\"2\"),$O$4:$XFD326,ROW()-3,FALSE),\"\")","v":""},{"$nulls":3},{"$f":"IF(OR($E326=\"\",$F326=\"\",O326=\"\",P326=\"\"),\"\",IF(AND(O326=$E326,P326=$F326),Reglement!$S$3*$J326,IF(SIGN($E326-$F326)=SIGN(O326-P326),Reglement!$S$4*$J326,0))*IF(AND($E326+$F326>=6,O326+P326>=6),Reglement!$S$29,IF(AND($E326+$F326>=4,O326+P326>=4),Reglement!$S$28,1)))","v":""}]
[null,null,{"$f":"Score!T177","v":"Chelsea"},{"$f":"Score!W177","v":"Watford"},{"$f":"IF(Score!U177<>\"\",Score!U177,\"\")","v":""},{"$f":"IF(Score!V177<>\"\",Score!V177,\"\")","v":""},1,1,1,"",{"$f":"IF($K$4<>0,HLOOKUP($K$4,$O$4:$XFD327,ROW()-3,FALSE),\"\")","v":""},{"$f":"IF($K$4<>0,HLOOKUP(CONCATENATE($K$4,\"1\"),$O$4:$XFD327,ROW()-3,FALSE),\"\")","v":""},{"$f":"IF($K$4<>0,HLOOKUP(CONCATENATE($K$4,\"2\"),$O$4:$XFD327,ROW()-3,FALSE),\"\")","v":""},{"$nulls":3},{"$f":"IF(OR($E327=\"\",$F327=\"\",O327=\"\",P327=\"\"),\"\",IF(AND(O327=$E327,P327=$F327),Reglement!$S$3*$J327,IF(SIGN($E327-$F327)=SIGN(O327-P327),Reglement!$S$4*$J327,0))*IF(AND($E327+$F327>=6,O327+P327>=6),Reglement!$S$29,IF(AND($E327+$F327>=4,O327+P327>=4),Reglement!$S$28,1)))","v":""}]
[null,null,{"$f":"Score!T178","v":"Leicester City"},{"$f":"Score!W178","v":"Crystal Palace"},{"$f":"IF(Score!U178<>\"\",Score!U178,\"\")","v":""},{"$f":"IF(Score!V178<>\"\",Score!V178,\"\")","v":""},1,1,1,"",{"$f":"IF($K$4<>0,HLOOKUP($K$4,$O$4:$XFD328,ROW()-3,FALSE),\"\")","v":""},{"$f":"IF($K$4<>0,HLOOKUP(CONCATENATE($K$4,\"1\"),$O$4:$XFD328,ROW()-3,FALSE),\"\")","v":""},{"$f":"IF($K$4<>0,HLOOKUP(CONCATENATE($K$4,\"2\"),$O$4:$XFD328,ROW()-3,FALSE),\"\")","v":""},{"$nulls":3},{"$f":"IF(OR($E328=\"\",$F328=\"\",O328=\"\",P328=\"\"),\"\",IF(AND(O328=$E328,P328=$F328),Reglement!$S$3*$J328,IF(SIGN($E328-$F328)=SIGN(O328-P328),Reglement!$S$4*$J328,0))*IF(AND($E328+$F328>=6,O328+P328>=6),Reglement!$S$29,IF(AND($E328+$F328>=4,O328+P328>=4),Reglement!$S$28,1)))","v":""}]
[null,null,{"$f":"Score!T179","v":"Liverpool"},{"$f":"Score!W179","v":"Aston Villa"},{"$f":"IF(Score!U179<>\"\",Score!U179,\"\")","v":""},{"$f":"IF(Score!V179<>\"\",Score!V179,\"\")","v":""},1,1,1,"",{"$f":"IF($K$4<>0,HLOOKUP($K$4,$O$4:$XFD329,ROW()-3,FALSE),\"\")","v":""},{"$f":"IF($K$4<>0,HLOOKUP(CONCATENATE($K$4,\"1\"),$O$4:$XFD329,ROW()-3,FALSE),\"\")","v":""},{"$f":"IF($K$4<>0,HLOOKUP(CONCATENATE($K$4,\"2\"),$O$4:$XFD329,ROW()-3,FALSE),\"\")","v":""},{"$nulls":3},{"$f":"IF(OR($E329=\"\",$F329=\"\",O329=\"\",P329=\"\"),\"\",IF(AND(O329=$E329,P329=$F329),Reglement!$S$3*$J329,IF(SIGN($E329-$F329)=SIGN(O329-P329),Reglement!$S$4*$J329,0))*IF(AND($E329+$F329>=6,O329+P329>=6),Reglement!$S$29,IF(AND($E329+$F329>=4,O329+P329>=4),Reglement!$S$28,1)))","v":""}]
[null,null,{"$f":"Score!T180","v":"Manchester United"},{"$f":"Score!W180","v":"Bournemouth"},{"$f":"IF(Score!U180<>\"\",Score!U180,\"\")","v":""},{"$f":"IF(Score!V180<>\"\",Score!V180,\"\")","v":""},1,1,1,"",{"$f":"IF($K$4<>0,HLOOKUP($K$4,$O$4:$XFD330,ROW()-3,FALSE),\"\")","v":""},{"$f":"IF($K$4<>0,HLOOKUP(CONCATENATE($K$4,\"1\"),$O$4:$XFD330,ROW()-3,FALSE),\"\")","v":""},{"$f":"IF($K$4<>0,HLOOKUP(CONCATENATE($K$4,\"2\"),$O$4:$XFD330,ROW()-3,FALSE),\"\")","v":""},{"$nulls":3},{"$f":"IF(OR($E330=\"\",$F330=\"\",O330=\"\",P330=\"\"),\"\",IF(AND(O330=$E330,P330=$F330),Reglement!$S$3*$J330,IF(SIGN($E330-$F330)=SIGN(O330-P330),Reglement!$S$4*$J330,0))*IF(AND($E330+$F330>=6,O330+P330>=6),Reglement!$S$29,IF(AND($E330+$F330>=4,O330+P330>=4),Reglement!$S$28,1)))","v":""}]
[null,null,{"$f":"Score!T181","v":"Newcastle"},{"$f":"Score!W181","v":"West Ham"},{"$f":"IF(Score!U181<>\"\",Score!U181,\"\")","v":""},{"$f":"IF(Score!V181<>\"\",Score!V181,\"\")","v":""},1,1,1,{"$f":"IF(OR(E331=\"\",F331=\"\"),\"\",IF(E331>F331,G331,IF(E331=F331,H331,I331)))","v":""},{"$f":"IF($K$4<>0,HLOOKUP($K$4,$O$4:$XFD331,ROW()-3,FALSE),\"\")","v":""},{"$f":"IF($K$4<>0,HLOOKUP(CONCATENATE($K$4,\"1\"),$O$4:$XFD331,ROW()-3,FALSE),\"\")","v":""},{"$f":"IF($K$4<>0,HLOOKUP(CONCATENATE($K$4,\"2\"),$O$4:$XFD331,ROW()-3,FALSE),\"\")","v":""},{"$nulls":3},{"$f":"IF(OR($E331=\"\",$F331=\"\",O331=\"\",P331=\"\"),\"\",IF(AND(O331=$E331,P331=$F331),Reglement!$S$3*$J331,IF(SIGN($E331-$F331)=SIGN(O331-P331),Reglement!$S$4*$J331,0))*IF(AND($E331+$F331>=6,O331+P331>=6),Reglement!$S$29,IF(AND($E331+$F331>=4,O331+P331>=4),Reglement!$S$28,1)))","v":""}]
[null,null,{"$f":"Score!T182","v":"Norwich"},{"$f":"Score!W182","v":"Brighton"},{"$f":"IF(Score!U182<>\"\",Score!U182,\"\")","v":""},{"$f":"IF(Score!V182<>\"\",Score!V182,\"\")","v":""},1,1,1,"",{"$f":"IF($K$4<>0,HLOOKUP($K$4,$O$4:$XFD332,ROW()-3,FALSE),\"\")","v":""},{"$f":"IF($K$4<>0,HLOOKUP(CONCATENATE($K$4,\"1\"),$O$4:$XFD332,ROW()-3,FALSE),\"\")","v":""},{"$f":"IF($K$4<>0,HLOOKUP(CONCATENATE($K$4,\"2\"),$O$4:$XFD332,ROW()-3,FALSE),\"\")","v":""},{"$nulls":3},{"$f":"IF(OR($E332=\"\",$F332=\"\",O332=\"\",P332=\"\"),\"\",IF(AND(O332=$E332,P332=$F332),Reglement!$S$3*$J332,IF(SIGN($E332-$F332)=SIGN(O332-P332),Reglement!$S$4*$J332,0))*IF(AND($E332+$F332>=6,O332+P332>=6),Reglement!$S$29,IF(AND($E332+$F332>=4,O332+P332>=4),Reglement!$S$28,1)))","v":""}]
[null,null,{"$f":"Score!T183","v":"Southampton"},{"$f":"Score!W183","v":"Manchester City"},{"$f":"IF(Score!U183<>\"\",Score!U183,\"\")","v":""},{"$f":"IF(Score!V183<>\"\",Score!V183,\"\")","v":""},1,1,1,"",{"$f":"IF($K$4<>0,HLOOKUP($K$4,$O$4:$XFD333,ROW()-3,FALSE),\"\")","v":""},{"$f":"IF($K$4<>0,HLOOKUP(CONCATENATE($K$4,\"1\"),$O$4:$XFD333,ROW()-3,FALSE),\"\")","v":""},{"$f":"IF($K$4<>0,HLOOKUP(CONCATENATE($K$4,\"2\"),$O$4:$XFD333,ROW()-3,FALSE),\"\")","v":""},{"$nulls":3},{"$f":"IF(OR($E333=\"\",$F333=\"\",O333=\"\",P333=\"\"),\"\",IF(AND(O333=$E333,P333=$F333),Reglement!$S$3*$J333,IF(SIGN($E333-$F333)=SIGN(O333-P333),Reglement!$S$4*$J333,0))*IF(AND($E333+$F333>=6,O333+P333>=6),Reglement!$S$29,IF(AND($E333+$F333>=4,O333+P333>=4),Reglement!$S$28,1)))","v":""}]
[null,null,{"$f":"Score!T184","v":"Tottenham"},{"$f":"Score!W184","v":"Everton"},{"$f":"IF(Score!U184<>\"\",Score!U184,\"\")","v":""},{"$f":"IF(Score!V184<>\"\",Score!V184,\"\")","v":""},1,1,1,"",{"$f":"IF($K$4<>0,HLOOKUP($K$4,$O$4:$XFD334,ROW()-3,FALSE),\"\")","v":""},{"$f":"IF($K$4<>0,HLOOKUP(CONCATENATE($K$4,\"1\"),$O$4:$XFD334,ROW()-3,FALSE),\"\")","v":""},{"$f":"IF($K$4<>0,HLOOKUP(CONCATENATE($K$4,\"2\"),$O$4:$XFD334,ROW()-3,FALSE),\"\")","v":""},{"$nulls":3},{"$f":"IF(OR($E334=\"\",$F334=\"\",O334=\"\",P334=\"\"),\"\",IF(AND(O334=$E334,P334=$F334),Reglement!$S$3*$J334,IF(SIGN($E334-$F334)=SIGN(O334-P334),Reglement!$S$4*$J334,0))*IF(AND($E334+$F334>=6,O334+P334>=6),Reglement!$S$29,IF(AND($E334+$F334>=4,O334+P334>=4),Reglement!$S$28,1)))","v":""}]
[null,null,{"$f":"Score!T185","v":"Wolverhampton"},{"$f":"Score!W185","v":"Arsenal"},{"$f":"IF(Score!U185<>\"\",Score!U185,\"\")","v":""},{"$f":"IF(Score!V185<>\"\",Score!V185,\"\")","v":""},1,1,1,"",{"$f":"IF($K$4<>0,HLOOKUP($K$4,$O$4:$XFD335,ROW()-3,FALSE),\"\")","v":""},{"$f":"IF($K$4<>0,HLOOKUP(CONCATENATE($K$4,\"1\"),$O$4:$XFD335,ROW()-3,FALSE),\"\")","v":""},{"$f":"IF($K$4<>0,HLOOKUP(CONCATENATE($K$4,\"2\"),$O$4:$XFD335,ROW()-3,FALSE),\"\")","v":""},{"$nulls":3},{"$f":"IF(OR($E335=\"\",$F335=\"\",O335=\"\",P335=\"\"),\"\",IF(AND(O335=$E335,P335=$F335),Reglement!$S$3*$J335,IF(SIGN($E335-$F335)=SIGN(O335-P335),Reglement!$S$4*$J335,0))*IF(AND($E335+$F335>=6,O335+P335>=6),Reglement!$S$29,IF(AND($E335+$F335>=4,O335+P335>=4),Reglement!$S$28,1)))","v":""}]
["JOURNEE n°34",null,{"$f":"Score!T189","v":"Bournemouth"},{"$f":"Score!W189","v":"Tottenham"},{"$f":"IF(Score!U189<>\"\",Score!U189,\"\")","v":""},{"$f":"IF(Score!V189<>\"\",Score!V189,\"\")","v":""},1,1,1,"",{"$f":"IF($K$4<>0,HLOOKUP($K$4,$O$4:$XFD336,ROW()-3,FALSE),\"\")","v":""},{"$f":"IF($K$4<>0,HLOOKUP(CONCATENATE($K$4,\"1\"),$O$4:$XFD336,ROW()-3,FALSE),\"\")","v":""},{"$f":"IF($K$4<>0,HLOOKUP(CONCATENATE($K$4,\"2\"),$O$4:$XFD336,ROW()-3,FALSE),\"\")","v":""},{"$nulls":3},{"$f":"IF(OR($E336=\"\",$F336=\"\",O336=\"\",P336=\"\"),\"\",IF(AND(O336=$E336,P336=$F336),Reglement!$S$3*$J336,IF(SIGN($E336-$F336)=SIGN(O336-P336),Reglement!$S$4*$J336,0))*IF(AND($E336+$F336>=6,O336+P336>=6),Reglement!$S$29,IF(AND($E336+$F336>=4,O336+P336>=4),Reglement!$S$28,1)))","v":""}]
[null,null,{"$f":"Score!T190","v":"Arsenal"},{"$f":"Score!W190","v":"Leicester City"},{"$f":"IF(Score!U190<>\"\",Score!U190,\"\")","v":""},{"$f":"IF(Score!V190<>\"\",Score!V190,\"\")","v":""},1,1,1,"",{"$f":"IF($K$4<>0,HLOOKUP($K$4,$O$4:$XFD337,ROW()-3,FALSE),\"\")","v":""},{"$f":"IF($K$4<>0,HLOOKUP(CONCATENATE($K$4,\"1\"),$O$4:$XFD337,ROW()-3,FALSE),\"\")","v":""},{"$f":"IF($K$4<>0,HLOOKUP(CONCATENATE($K$4,\"2\"),$O$4:$XFD337,ROW()-3,FALSE),\"\")","v":""},{"$nulls":3},{"$f":"IF(OR($E337=\"\",$F337=\"\",O337=\"\",P337=\"\"),\"\",IF(AND(O337=$E337,P337=$F337),Reglement!$S$3*$J337,IF(SIGN($E337-$F337)=SIGN(O337-P337),Reglement!$S$4*$J337,0))*IF(AND($E337+$F337>=6,O337+P337>=6),Reglement!$S$29,IF(AND($E337+$F337>=4,O337+P337>=4),Reglement!$S$28,1)))","v":""}]
[null,null,{"$f":"Score!T191","v":"Aston Villa"},{"$f":"Score!W191","v":"Manchester United"},{"$f":"IF(Score!U191<>\"\",Score!U191,\"\")","v":""},{"$f":"IF(Score!V191<>\"\",Score!V191,\"\")","v":""},1,1,1,"",{"$f":"IF($K$4<>0,HLOOKUP($K$4,$O$4:$XFD338,ROW()-3,FALSE),\"\")","v":""},{"$f":"IF($K$4<>0,HLOOKUP(CONCATENATE($K$4,\"1\"),$O$4:$XFD338,ROW()-3,FALSE),\"\")","v":""},{"$f":"IF($K$4<>0,HLOOKUP(CONCATENATE($K$4,\"2\"),$O$4:$XFD338,ROW()-3,FALSE),\"\")","v":""},{"$nulls":3},{"$f":"IF(OR($E338=\"\",$F338=\"\",O338=\"\",P338=\"\"),\"\",IF(AND(O338=$E338,P338=$F338),Reglement!$S$3*$J338,IF(SIGN($E338-$F338)=SIGN(O338-P338),Reglement!$S$4*$J338,0))*IF(AND($E338+$F338>=6,O338+P338>=6),Reglement!$S$29,IF(AND($E338+$F338>=4,O338+P338>=4),Reglement!$S$28,1)))","v":""}]
[null,null,{"$f":"Score!T192","v":"Brighton"},{"$f":"Score!W192","v":"Liverpool"},{"$f":"IF(Score!U192<>\"\",Score!U192,\"\")","v":""},{"$f":"IF(Score!V192<>\"\",Score!V192,\"\")","v":""},1,1,1,"",{"$f":"IF($K$4<>0,HLOOKUP($K$4,$O$4:$XFD339,ROW()-3,FALSE),\"\")","v":""},{"$f":"IF($K$4<>0,HLOOKUP(CONCATENATE($K$4,\"1\"),$O$4:$XFD339,ROW()-3,FALSE),\"\")","v":""},{"$f":"IF($K$4<>0,HLOOKUP(CONCATENATE($K$4,\"2\"),$O$4:$XFD339,ROW()-3,FALSE),\"\")","v":""},{"$nulls":3},{"$f":"IF(OR($E339=\"\",$F339=\"\",O339=\"\",P339=\"\"),\"\",IF(AND(O339=$E339,P339=$F339),Reglement!$S$3*$J339,IF(SIGN($E339-$F339)=SIGN(O339-P339),Reglement!$S$4*$J339,0))*IF(AND($E339+$F339>=6,O339+P339>=6),Reglement!$S$29,IF(AND($E339+$F339>=4,O339+P339>=4),Reglement!$S$28,1)))","v":""}]
[null,null,{"$f":"Score!T193","v":"Crystal Palace"},{"$f":"Score!W193","v":"Chelsea"},{"$f":"IF(Score!U193<>\"\",Score!U193,\"\")","v":""},{"$f":"IF(Score!V193<>\"\",Score!V193,\"\")","v":""},1,1,1,{"$f":"IF(OR(E340=\"\",F340=\"\"),\"\",IF(E340>F340,G340,IF(E340=F340,H340,I340)))","v":""},{"$f":"IF($K$4<>0,HLOOKUP($K$4,$O$4:$XFD340,ROW()-3,FALSE),\"\")","v":""},{"$f":"IF($K$4<>0,HLOOKUP(CONCATENATE($K$4,\"1\"),$O$4:$XFD340,ROW()-3,FALSE),\"\")","v":""},{"$f":"IF($K$4<>0,HLOOKUP(CONCATENATE($K$4,\"2\"),$O$4:$XFD340,ROW()-3,FALSE),\"\")","v":""},{"$nulls":3},{"$f":"IF(OR($E340=\"\",$F340=\"\",O340=\"\",P340=\"\"),\"\",IF(AND(O340=$E340,P340=$F340),Reglement!$S$3*$J340,IF(SIGN($E340-$F340)=SIGN(O340-P340),Reglement!$S$4*$J340,0))*IF(AND($E340+$F340>=6,O340+P340>=6),Reglement!$S$29,IF(AND($E340+$F340>=4,O340+P340>=4),Reglement!$S$28,1)))","v":""}]
[null,null,{"$f":"Score!T194","v":"Everton"},{"$f":"Score!W194","v":"Southampton"},{"$f":"IF(Score!U194<>\"\",Score!U194,\"\")","v":""},{"$f":"IF(Score!V194<>\"\",Score!V194,\"\")","v":""},1,1,1,"",{"$f":"IF($K$4<>0,HLOOKUP($K$4,$O$4:$XFD341,ROW()-3,FALSE),\"\")","v":""},{"$f":"IF($K$4<>0,HLOOKUP(CONCATENATE($K$4,\"1\"),$O$4:$XFD341,ROW()-3,FALSE),\"\")","v":""},{"$f":"IF($K$4<>0,HLOOKUP(CONCATENATE($K$4,\"2\"),$O$4:$XFD341,ROW()-3,FALSE),\"\")","v":""},{"$nulls":3},{"$f":"IF(OR($E341=\"\",$F341=\"\",O341=\"\",P341=\"\"),\"\",IF(AND(O341=$E341,P341=$F341),Reglement!$S$3*$J341,IF(SIGN($E341-$F341)=SIGN(O341-P341),Reglement!$S$4*$J341,0))*IF(AND($E341+$F341>=6,O341+P341>=6),Reglement!$S$29,IF(AND($E341+$F341>=4,O341+P341>=4),Reglement!$S$28,1)))","v":""}]
[null,null,{"$f":"Score!T195","v":"Manchester City"},{"$f":"Score!W195","v":"Newcastle"},{"$f":"IF(Score!U195<>\"\",Score!U195,\"\")","v":""},{"$f":"IF(Score!V195<>\"\",Score!V195,\"\")","v":""},1,1,1,"",{"$f":"IF($K$4<>0,HLOOKUP($K$4,$O$4:$XFD342,ROW()-3,FALSE),\"\")","v":""},{"$f":"IF($K$4<>0,HLOOKUP(CONCATENATE($K$4,\"1\"),$O$4:$XFD342,ROW()-3,FALSE),\"\")","v":""},{"$f":"IF($K$4<>0,HLOOKUP(CONCATENATE($K$4,\"2\"),$O$4:$XFD342,ROW()-3,FALSE),\"\")","v":""},{"$nulls":3},{"$f":"IF(OR($E342=\"\",$F342=\"\",O342=\"\",P342=\"\"),\"\",IF(AND(O342=$E342,P342=$F342),Reglement!$S$3*$J342,IF(SIGN($E342-$F342)=SIGN(O342-P342),Reglement!$S$4*$J342,0))*IF(AND($E342+$F342>=6,O342+P342>=6),Reglement!$S$29,IF(AND($E342+$F342>=4,O342+P342>=4),Reglement!$S$28,1)))","v":""}]
[null,null,{"$f":"Score!T196","v":"Sheffield United"},{"$f":"Score!W196","v":"Wolverhampton"},{"$f":"IF(Score!U196<>\"\",Score!U196,\"\")","v":""},{"$f":"IF(Score!V196<>\"\",Score!V196,\"\")","v":""},1,1,1,"",{"$f":"IF($K$4<>0,HLOOKUP($K$4,$O$4:$XFD343,ROW()-3,FALSE),\"\")","v":""},{"$f":"IF($K$4<>0,HLOOKUP(CONCATENATE($K$4,\"1\"),$O$4:$XFD343,ROW()-3,FALSE),\"\")","v":""},{"$f":"IF($K$4<>0,HLOOKUP(CONCATENATE($K$4,\"2\"),$O$4:$XFD343,ROW()-3,FALSE),\"\")","v":""},{"$nulls":3},{"$f":"IF(OR($E343=\"\",$F343=\"\",O343=\"\",P343=\"\"),\"\",IF(AND(O343=$E343,P343=$F343),Reglement!$S$3*$J343,IF(SIGN($E343-$F343)=SIGN(O343-P343),Reglement!$S$4*$J343,0))*IF(AND($E343+$F343>=6,O343+P343>=6),Reglement!$S$29,IF(AND($E343+$F343>=4,O343+P343>=4),Reglement!$S$28,1)))","v":""}]
[null,null,{"$f":"Score!T197","v":"Watford"},{"$f":"Score!W197","v":"Norwich"},{"$f":"IF(Score!U197<>\"\",Score!U197,\"\")","v":""},{"$f":"IF(Score!V197<>\"\",Score!V197,\"\")","v":""},1,1,1,"",{"$f":"IF($K$4<>0,HLOOKUP($K$4,$O$4:$XFD344,ROW()-3,FALSE),\"\")","v":""},{"$f":"IF($K$4<>0,HLOOKUP(CONCATENATE($K$4,\"1\"),$O$4:$XFD344,ROW()-3,FALSE),\"\")","v":""},{"$f":"IF($K$4<>0,HLOOKUP(CONCATENATE($K$4,\"2\"),$O$4:$XFD344,ROW()-3,FALSE),\"\")","v":""},{"$nulls":3},{"$f":"IF(OR($E344=\"\",$F344=\"\",O344=\"\",P344=\"\"),\"\",IF(AND(O344=$E344,P344=$F344),Reglement!$S$3*$J344,IF(SIGN($E344-$F344)=SIGN(O344-P344),Reglement!$S$4*$J344,0))*IF(AND($E344+$F344>=6,O344+P344>=6),Reglement!$S$29,IF(AND($E344+$F344>=4,O344+P344>=4),Reglement!$S$28,1)))","v":""}]
[null,null,{"$f":"Score!T198","v":"West Ham"},{"$f":"Score!W198","v":"Burnley"},{"$f":"IF(Score!U198<>\"\",Score!U198,\"\")","v":""},{"$f":"IF(Score!V198<>\"\",Score!V198,\"\")","v":""},1,1,1,"",{"$f":"IF($K$4<>0,HLOOKUP($K$4,$O$4:$XFD345,ROW()-3,FALSE),\"\")","v":""},{"$f":"IF($K$4<>0,HLOOKUP(CONCATENATE($K$4,\"1\"),$O$4:$XFD345,ROW()-3,FALSE),\"\")","v":""},{"$f":"IF($K$4<>0,HLOOKUP(CONCATENATE($K$4,\"2\"),$O$4:$XFD345,ROW()-3,FALSE),\"\")","v":""},{"$nulls":3},{"$f":"IF(OR($E345=\"\",$F345=\"\",O345=\"\",P345=\"\"),\"\",IF(AND(O345=$E345,P345=$F345),Reglement!$S$3*$J345,IF(SIGN($E345-$F345)=SIGN(O345-P345),Reglement!$S$4*$J345,0))*IF(AND($E345+$F345>=6,O345+P345>=6),Reglement!$S$29,IF(AND($E345+$F345>=4,O345+P345>=4),Reglement!$S$28,1)))","v":""}]
["JOURNEE n°35",null,{"$f":"Score!T202","v":"Bournemouth"},{"$f":"Score!W202","v":"Leicester City"},{"$f":"IF(Score!U202<>\"\",Score!U202,\"\")","v":""},{"$f":"IF(Score!V202<>\"\",Score!V202,\"\")","v":""},1,1,1,"",{"$f":"IF($K$4<>0,HLOOKUP($K$4,$O$4:$XFD346,ROW()-3,FALSE),\"\")","v":""},{"$f":"IF($K$4<>0,HLOOKUP(CONCATENATE($K$4,\"1\"),$O$4:$XFD346,ROW()-3,FALSE),\"\")","v":""},{"$f":"IF($K$4<>0,HLOOKUP(CONCATENATE($K$4,\"2\"),$O$4:$XFD346,ROW()-3,FALSE),\"\")","v":""},{"$nulls":3},{"$f":"IF(OR($E346=\"\",$F346=\"\",O346=\"\",P346=\"\"),\"\",IF(AND(O346=$E346,P346=$F346),Reglement!$S$3*$J346,IF(SIGN($E346-$F346)=SIGN(O346-P346),Reglement!$S$4*$J346,0))*IF(AND($E346+$F346>=6,O346+P346>=6),Reglement!$S$29,IF(AND($E346+$F346>=4,O346+P346>=4),Reglement!$S$28,1)))","v":""}]
[null,null,{"$f":"Score!T203","v":"Aston Villa"},{"$f":"Score!W203","v":"Crystal Palace"},{"$f":"IF(Score!U203<>\"\",Score!U203,\"\")","v":""},{"$f":"IF(Score!V203<>\"\",Score!V203,\"\")","v":""},1,1,1,"",{"$f":"IF($K$4<>0,HLOOKUP($K$4,$O$4:$XFD347,ROW()-3,FALSE),\"\")","v":""},{"$f":"IF($K$4<>0,HLOOKUP(CONCATENATE($K$4,\"1\"),$O$4:$XFD347,ROW()-3,FALSE),\"\")","v":""},{"$f":"IF($K$4<>0,HLOOKUP(CONCATENATE($K$4,\"2\"),$O$4:$XFD347,ROW()-3,FALSE),\"\")","v":""},{"$nulls":3},{"$f":"IF(OR($E347=\"\",$F347=\"\",O347=\"\",P347=\"\"),\"\",IF(AND(O347=$E347,P347=$F347),Reglement!$S$3*$J347,IF(SIGN($E347-$F347)=SIGN(O347-P347),Reglement!$S$4*$J347,0))*IF(AND($E347+$F347>=6,O347+P347>=6),Reglement!$S$29,IF(AND($E347+$F347>=4,O347+P347>=4),Reglement!$S$28,1)))","v":""}]
[null,null,{"$f":"Score!T204","v":"Brighton"},{"$f":"Score!W204","v":"Manchester City"},{"$f":"IF(Score!U204<>\"\",Score!U204,\"\")","v":""},{"$f":"IF(Score!V204<>\"\",Score!V204,\"\")","v":""},1,1,1,"",{"$f":"IF($K$4<>0,HLOOKUP($K$4,$O$4:$XFD348,ROW()-3,FALSE),\"\")","v":""},{"$f":"IF($K$4<>0,HLOOKUP(CONCATENATE($K$4,\"1\"),$O$4:$XFD348,ROW()-3,FALSE),\"\")","v":""},{"$f":"IF($K$4<>0,HLOOKUP(CONCATENATE($K$4,\"2\"),$O$4:$XFD348,ROW()-3,FALSE),\"\")","v":""},{"$nulls":3},{"$f":"IF(OR($E348=\"\",$F348=\"\",O348=\"\",P348=\"\"),\"\",IF(AND(O348=$E348,P348=$F348),Reglement!$S$3*$J348,IF(SIGN($E348-$F348)=SIGN(O348-P348),Reglement!$S$4*$J348,0))*IF(AND($E348+$F348>=6,O348+P348>=6),Reglement!$S$29,IF(AND($E348+$F348>=4,O348+P348>=4),Reglement!$S$28,1)))","v":""}]
[null,null,{"$f":"Score!T205","v":"Liverpool"},{"$f":"Score!W205","v":"Burnley"},{"$f":"IF(Score!U205<>\"\",Score!U205,\"\")","v":""},{"$f":"IF(Score!V205<>\"\",Score!V205,\"\")","v":""},1,1,1,"",{"$f":"IF($K$4<>0,HLOOKUP($K$4,$O$4:$XFD349,ROW()-3,FALSE),\"\")","v":""},{"$f":"IF($K$4<>0,HLOOKUP(CONCATENATE($K$4,\"1\"),$O$4:$XFD349,ROW()-3,FALSE),\"\")","v":""},{"$f":"IF($K$4<>0,HLOOKUP(CONCATENATE($K$4,\"2\"),$O$4:$XFD349,ROW()-3,FALSE),\"\")","v":""},{"$nulls":3},{"$f":"IF(OR($E349=\"\",$F349=\"\",O349=\"\",P349=\"\"),\"\",IF(AND(O349=$E349,P349=$F349),Reglement!$S$3*$J349,IF(SIGN($E349-$F349)=SIGN(O349-P349),Reglement!$S$4*$J349,0))*IF(AND($E349+$F349>=6,O349+P349>=6),Reglement!$S$29,IF(AND($E349+$F349>=4,O349+P349>=4),Reglement!$S$28,1)))","v":""}]
[null,null,{"$f":"Score!T206","v":"Manchester United"},{"$f":"Score!W206","v":"Southampton"},{"$f":"IF(Score!U206<>\"\",Score!U206,\"\")","v":""},{"$f":"IF(Score!V206<>\"\",Score!V206,\"\")","v":""},1,1,1,"",{"$f":"IF($K$4<>0,HLOOKUP($K$4,$O$4:$XFD350,ROW()-3,FALSE),\"\")","v":""},{"$f":"IF($K$4<>0,HLOOKUP(CONCATENATE($K$4,\"1\"),$O$4:$XFD350,ROW()-3,FALSE),\"\")","v":""},{"$f":"IF($K$4<>0,HLOOKUP(CONCATENATE($K$4,\"2\"),$O$4:$XFD350,ROW()-3,FALSE),\"\")","v":""},{"$nulls":3},{"$f":"IF(OR($E350=\"\",$F350=\"\",O350=\"\",P350=\"\"),\"\",IF(AND(O350=$E350,P350=$F350),Reglement!$S$3*$J350,IF(SIGN($E350-$F350)=SIGN(O350-P350),Reglement!$S$4*$J350,0))*IF(AND($E350+$F350>=6,O350+P350>=6),Reglement!$S$29,IF(AND($E350+$F350>=4,O350+P350>=4),Reglement!$S$28,1)))","v":""}]
[null,null,{"$f":"Score!T207","v":"Norwich"},{"$f":"Score!W207","v":"West Ham"},{"$f":"IF(Score!U207<>\"\",Score!U207,\"\")","v":""},{"$f":"IF(Score!V207<>\"\",Score!V207,\"\")","v":""},1,1,1,"",{"$f":"IF($K$4<>0,HLOOKUP($K$4,$O$4:$XFD351,ROW()-3,FALSE),\"\")","v":""},{"$f":"IF($K$4<>0,HLOOKUP(CONCATENATE($K$4,\"1\"),$O$4:$XFD351,ROW()-3,FALSE),\"\")","v":""},{"$f":"IF($K$4<>0,HLOOKUP(CONCATENATE($K$4,\"2\"),$O$4:$XFD351,ROW()-3,FALSE),\"\")","v":""},{"$nulls":3},{"$f":"IF(OR($E351=\"\",$F351=\"\",O351=\"\",P351=\"\"),\"\",IF(AND(O351=$E351,P351=$F351),Reglement!$S$3*$J351,IF(SIGN($E351-$F351)=SIGN(O351-P351),Reglement!$S$4*$J351,0))*IF(AND($E351+$F351>=6,O351+P351>=6),Reglement!$S$29,IF(AND($E351+$F351>=4,O351+P351>=4),Reglement!$S$28,1)))","v":""}]
[null,null,{"$f":"Score!T208","v":"Sheffield United"},{"$f":"Score!W208","v":"Chelsea"},{"$f":"IF(Score!U208<>\"\",Score!U208,\"\")","v":""},{"$f":"IF(Score!V208<>\"\",Score!V208,\"\")","v":""},1,1,1,"",{"$f":"IF($K$4<>0,HLOOKUP($K$4,$O$4:$XFD352,ROW()-3,FALSE),\"\")","v":""},{"$f":"IF($K$4<>0,HLOOKUP(CONCATENATE($K$4,\"1\"),$O$4:$XFD352,ROW()-3,FALSE),\"\")","v":""},{"$f":"IF($K$4<>0,HLOOKUP(CONCATENATE($K$4,\"2\"),$O$4:$XFD352,ROW()-3,FALSE),\"\")","v":""},{"$nulls":3},{"$f":"IF(OR($E352=\"\",$F352=\"\",O352=\"\",P352=\"\"),\"\",IF(AND(O352=$E352,P352=$F352),Reglement!$S$3*$J352,IF(SIGN($E352-$F352)=SIGN(O352-P352),Reglement!$S$4*$J352,0))*IF(AND($E352+$F352>=6,O352+P352>=6),Reglement!$S$29,IF(AND($E352+$F352>=4,O352+P352>=4),Reglement!$S$28,1)))","v":""}]
[null,null,{"$f":"Score!T209","v":"Tottenham"},{"$f":"Score!W209","v":"Arsenal"},{"$f":"IF(Score!U209<>\"\",Score!U209,\"\")","v":""},{"$f":"IF(Score!V209<>\"\",Score!V209,\"\")","v":""},1,1,1,"",{"$f":"IF($K$4<>0,HLOOKUP($K$4,$O$4:$XFD353,ROW()-3,FALSE),\"\")","v":""},{"$f":"IF($K$4<>0,HLOOKUP(CONCATENATE($K$4,\"1\"),$O$4:$XFD353,ROW()-3,FALSE),\"\")","v":""},{"$f":"IF($K$4<>0,HLOOKUP(CONCATENATE($K$4,\"2\"),$O$4:$XFD353,ROW()-3,FALSE),\"\")","v":""},{"$nulls":3},{"$f":"IF(OR($E353=\"\",$F353=\"\",O353=\"\",P353=\"\"),\"\",IF(AND(O353=$E353,P353=$F353),Reglement!$S$3*$J353,IF(SIGN($E353-$F353)=SIGN(O353-P353),Reglement!$S$4*$J353,0))*IF(AND($E353+$F353>=6,O353+P353>=6),Reglement!$S$29,IF(AND($E353+$F353>=4,O353+P353>=4),Reglement!$S$28,1)))","v":""}]
[null,null,{"$f":"Score!T210","v":"Watford"},{"$f":"Score!W210","v":"Newcastle"},{"$f":"IF(Score!U210<>\"\",Score!U210,\"\")","v":""},{"$f":"IF(Score!V210<>\"\",Score!V210,\"\")","v":""},1,1,1,"",{"$f":"IF($K$4<>0,HLOOKUP($K$4,$O$4:$XFD354,ROW()-3,FALSE),\"\")","v":""},{"$f":"IF($K$4<>0,HLOOKUP(CONCATENATE($K$4,\"1\"),$O$4:$XFD354,ROW()-3,FALSE),\"\")","v":""},{"$f":"IF($K$4<>0,HLOOKUP(CONCATENATE($K$4,\"2\"),$O$4:$XFD354,ROW()-3,FALSE),\"\")","v":""},{"$nulls":3},{"$f":"IF(OR($E354=\"\",$F354=\"\",O354=\"\",P354=\"\"),\"\",IF(AND(O354=$E354,P354=$F354),Reglement!$S$3*$J354,IF(SIGN($E354-$F354)=SIGN(O354-P354),Reglement!$S$4*$J354,0))*IF(AND($E354+$F354>=6,O354+P354>=6),Reglement!$S$29,IF(AND($E354+$F354>=4,O354+P354>=4),Reglement!$S$28,1)))","v":""}]
[null,null,{"$f":"Score!T211","v":"Wolverhampton"},{"$f":"Score!W211","v":"Everton"},{"$f":"IF(Score!U211<>\"\",Score!U211,\"\")","v":""},{"$f":"IF(Score!V211<>\"\",Score!V211,\"\")","v":""},1,1,1,"",{"$f":"IF($K$4<>0,HLOOKUP($K$4,$O$4:$XFD355,ROW()-3,FALSE),\"\")","v":""},{"$f":"IF($K$4<>0,HLOOKUP(CONCATENATE($K$4,\"1\"),$O$4:$XFD355,ROW()-3,FALSE),\"\")","v":""},{"$f":"IF($K$4<>0,HLOOKUP(CONCATENATE($K$4,\"2\"),$O$4:$XFD355,ROW()-3,FALSE),\"\")","v":""},{"$nulls":3},{"$f":"IF(OR($E355=\"\",$F355=\"\",O355=\"\",P355=\"\"),\"\",IF(AND(O355=$E355,P355=$F355),Reglement!$S$3*$J355,IF(SIGN($E355-$F355)=SIGN(O355-P355),Reglement!$S$4*$J355,0))*IF(AND($E355+$F355>=6,O355+P355>=6),Reglement!$S$29,IF(AND($E355+$F355>=4,O355+P355>=4),Reglement!$S$28,1)))","v":""}]
["JOURNEE n°36",null,{"$f":"Score!T215","v":"Arsenal"},{"$f":"Score!W215","v":"Liverpool"},{"$f":"IF(Score!U215<>\"\",Score!U215,\"\")","v":""},{"$f":"IF(Score!V215<>\"\",Score!V215,\"\")","v":""},1,1,1,"",{"$f":"IF($K$4<>0,HLOOKUP($K$4,$O$4:$XFD356,ROW()-3,FALSE),\"\")","v":""},{"$f":"IF($K$4<>0,HLOOKUP(CONCATENATE($K$4,\"1\"),$O$4:$XFD356,ROW()-3,FALSE),\"\")","v":""},{"$f":"IF($K$4<>0,HLOOKUP(CONCATENATE($K$4,\"2\"),$O$4:$XFD356,ROW()-3,FALSE),\"\")","v":""},{"$nulls":3},{"$f":"IF(OR($E356=\"\",$F356=\"\",O356=\"\",P356=\"\"),\"\",IF(AND(O356=$E356,P356=$F356),Reglement!$S$3*$J356,IF(SIGN($E356-$F356)=SIGN(O356-P356),Reglement!$S$4*$J356,0))*IF(AND($E356+$F356>=6,O356+P356>=6),Reglement!$S$29,IF(AND($E356+$F356>=4,O356+P356>=4),Reglement!$S$28,1)))","v":""}]
[null,null,{"$f":"Score!T216","v":"Burnley"},{"$f":"Score!W216","v":"Wolverhampton"},{"$f":"IF(Score!U216<>\"\",Score!U216,\"\")","v":""},{"$f":"IF(Score!V216<>\"\",Score!V216,\"\")","v":""},1,1,1,"",{"$f":"IF($K$4<>0,HLOOKUP($K$4,$O$4:$XFD357,ROW()-3,FALSE),\"\")","v":""},{"$f":"IF($K$4<>0,HLOOKUP(CONCATENATE($K$4,\"1\"),$O$4:$XFD357,ROW()-3,FALSE),\"\")","v":""},{"$f":"IF($K$4<>0,HLOOKUP(CONCATENATE($K$4,\"2\"),$O$4:$XFD357,ROW()-3,FALSE),\"\")","v":""},{"$nulls":3},{"$f":"IF(OR($E357=\"\",$F357=\"\",O357=\"\",P357=\"\"),\"\",IF(AND(O357=$E357,P357=$F357),Reglement!$S$3*$J357,IF(SIGN($E357-$F357)=SIGN(O357-P357),Reglement!$S$4*$J357,0))*IF(AND($E357+$F357>=6,O357+P357>=6),Reglement!$S$29,IF(AND($E357+$F357>=4,O357+P357>=4),Reglement!$S$28,1)))","v":""}]
[null,null,{"$f":"Score!T217","v":"Chelsea"},{"$f":"Score!W217","v":"Norwich"},{"$f":"IF(Score!U217<>\"\",Score!U217,\"\")","v":""},{"$f":"IF(Score!V217<>\"\",Score!V217,\"\")","v":""},1,1,1,"",{"$f":"IF($K$4<>0,HLOOKUP($K$4,$O$4:$XFD358,ROW()-3,FALSE),\"\")","v":""},{"$f":"IF($K$4<>0,HLOOKUP(CONCATENATE($K$4,\"1\"),$O$4:$XFD358,ROW()-3,FALSE),\"\")","v":""},{"$f":"IF($K$4<>0,HLOOKUP(CONCATENATE($K$4,\"2\"),$O$4:$XFD358,ROW()-3,FALSE),\"\")","v":""},{"$nulls":3},{"$f":"IF(OR($E358=\"\",$F358=\"\",O358=\"\",P358=\"\"),\"\",IF(AND(O358=$E358,P358=$F358),Reglement!$S$3*$J358,IF(SIGN($E358-$F358)=SIGN(O358-P358),Reglement!$S$4*$J358,0))*IF(AND($E358+$F358>=6,O358+P358>=6),Reglement!$S$29,IF(AND($E358+$F358>=4,O358+P358>=4),Reglement!$S$28,1)))","v":""}]
[null,null,{"$f":"Score!T218","v":"Crystal Palace"},{"$f":"Score!W218","v":"Manchester United"},{"$f":"IF(Score!U218<>\"\",Score!U218,\"\")","v":""},{"$f":"IF(Score!V218<>\"\",Score!V218,\"\")","v":""},1,1,1,"",{"$f":"IF($K$4<>0,HLOOKUP($K$4,$O$4:$XFD359,ROW()-3,FALSE),\"\")","v":""},{"$f":"IF($K$4<>0,HLOOKUP(CONCATENATE($K$4,\"1\"),$O$4:$XFD359,ROW()-3,FALSE),\"\")","v":""},{"$f":"IF($K$4<>0,HLOOKUP(CONCATENATE($K$4,\"2\"),$O$4:$XFD359,ROW()-3,FALSE),\"\")","v":""},{"$nulls":3},{"$f":"IF(OR($E359=\"\",$F359=\"\",O359=\"\",P359=\"\"),\"\",IF(AND(O359=$E359,P359=$F359),Reglement!$S$3*$J359,IF(SIGN($E359-$F359)=SIGN(O359-P359),Reglement!$S$4*$J359,0))*IF(AND($E359+$F359>=6,O359+P359>=6),Reglement!$S$29,IF(AND($E359+$F359>=4,O359+P359>=4),Reglement!$S$28,1)))","v":""}]
[null,null,{"$f":"Score!T219","v":"Everton"},{"$f":"Score!W219","v":"Aston Villa"},{"$f":"IF(Score!U219<>\"\",Score!U219,\"\")","v":""},{"$f":"IF(Score!V219<>\"\",Score!V219,\"\")","v":""},1,1,1,"",{"$f":"IF($K$4<>0,HLOOKUP($K$4,$O$4:$XFD360,ROW()-3,FALSE),\"\")","v":""},{"$f":"IF($K$4<>0,HLOOKUP(CONCATENATE($K$4,\"1\"),$O$4:$XFD360,ROW()-3,FALSE),\"\")","v":""},{"$f":"IF($K$4<>0,HLOOKUP(CONCATENATE($K$4,\"2\"),$O$4:$XFD360,ROW()-3,FALSE),\"\")","v":""},{"$nulls":3},{"$f":"IF(OR($E360=\"\",$F360=\"\",O360=\"\",P360=\"\"),\"\",IF(AND(O360=$E360,P360=$F360),Reglement!$S$3*$J360,IF(SIGN($E360-$F360)=SIGN(O360-P360),Reglement!$S$4*$J360,0))*IF(AND($E360+$F360>=6,O360+P360>=6),Reglement!$S$29,IF(AND($E360+$F360>=4,O360+P360>=4),Reglement!$S$28,1)))","v":""}]
[null,null,{"$f":"Score!T220","v":"Leicester City"},{"$f":"Score!W220","v":"Sheffield United"},{"$f":"IF(Score!U220<>\"\",Score!U220,\"\")","v":""},{"$f":"IF(Score!V220<>\"\",Score!V220,\"\")","v":""},1,1,1,"",{"$f":"IF($K$4<>0,HLOOKUP($K$4,$O$4:$XFD361,ROW()-3,FALSE),\"\")","v":""},{"$f":"IF($K$4<>0,HLOOKUP(CONCATENATE($K$4,\"1\"),$O$4:$XFD361,ROW()-3,FALSE),\"\")","v":""},{"$f":"IF($K$4<>0,HLOOKUP(CONCATENATE($K$4,\"2\"),$O$4:$XFD361,ROW()-3,FALSE),\"\")","v":""},{"$nulls":3},{"$f":"IF(OR($E361=\"\",$F361=\"\",O361=\"\",P361=\"\"),\"\",IF(AND(O361=$E361,P361=$F361),Reglement!$S$3*$J361,IF(SIGN($E361-$F361)=SIGN(O361-P361),Reglement!$S$4*$J361,0))*IF(AND($E361+$F361>=6,O361+P361>=6),Reglement!$S$29,IF(AND($E361+$F361>=4,O361+P361>=4),Reglement!$S$28,1)))","v":""}]
[null,null,{"$f":"Score!T221","v":"Manchester City"},{"$f":"Score!W221","v":"Bournemouth"},{"$f":"IF(Score!U221<>\"\",Score!U221,\"\")","v":""},{"$f":"IF(Score!V221<>\"\",Score!V221,\"\")","v":""},1,1,1,"",{"$f":"IF($K$4<>0,HLOOKUP($K$4,$O$4:$XFD362,ROW()-3,FALSE),\"\")","v":""},{"$f":"IF($K$4<>0,HLOOKUP(CONCATENATE($K$4,\"1\"),$O$4:$XFD362,ROW()-3,FALSE),\"\")","v":""},{"$f":"IF($K$4<>0,HLOOKUP(CONCATENATE($K$4,\"2\"),$O$4:$XFD362,ROW()-3,FALSE),\"\")","v":""},{"$nulls":3},{"$f":"IF(OR($E362=\"\",$F362=\"\",O362=\"\",P362=\"\"),\"\",IF(AND(O362=$E362,P362=$F362),Reglement!$S$3*$J362,IF(SIGN($E362-$F362)=SIGN(O362-P362),Reglement!$S$4*$J362,0))*IF(AND($E362+$F362>=6,O362+P362>=6),Reglement!$S$29,IF(AND($E362+$F362>=4,O362+P362>=4),Reglement!$S$28,1)))","v":""}]
[null,null,{"$f":"Score!T222","v":"Newcastle"},{"$f":"Score!W222","v":"Tottenham"},{"$f":"IF(Score!U222<>\"\",Score!U222,\"\")","v":""},{"$f":"IF(Score!V222<>\"\",Score!V222,\"\")","v":""},1,1,1,"",{"$f":"IF($K$4<>0,HLOOKUP($K$4,$O$4:$XFD363,ROW()-3,FALSE),\"\")","v":""},{"$f":"IF($K$4<>0,HLOOKUP(CONCATENATE($K$4,\"1\"),$O$4:$XFD363,ROW()-3,FALSE),\"\")","v":""},{"$f":"IF($K$4<>0,HLOOKUP(CONCATENATE($K$4,\"2\"),$O$4:$XFD363,ROW()-3,FALSE),\"\")","v":""},{"$nulls":3},{"$f":"IF(OR($E363=\"\",$F363=\"\",O363=\"\",P363=\"\"),\"\",IF(AND(O363=$E363,P363=$F363),Reglement!$S$3*$J363,IF(SIGN($E363-$F363)=SIGN(O363-P363),Reglement!$S$4*$J363,0))*IF(AND($E363+$F363>=6,O363+P363>=6),Reglement!$S$29,IF(AND($E363+$F363>=4,O363+P363>=4),Reglement!$S$28,1)))","v":""}]
[null,null,{"$f":"Score!T223","v":"Southampton"},{"$f":"Score!W223","v":"Brighton"},{"$f":"IF(Score!U223<>\"\",Score!U223,\"\")","v":""},{"$f":"IF(Score!V223<>\"\",Score!V223,\"\")","v":""},1,1,1,"",{"$f":"IF($K$4<>0,HLOOKUP($K$4,$O$4:$XFD364,ROW()-3,FALSE),\"\")","v":""},{"$f":"IF($K$4<>0,HLOOKUP(CONCATENATE($K$4,\"1\"),$O$4:$XFD364,ROW()-3,FALSE),\"\")","v":""},{"$f":"IF($K$4<>0,HLOOKUP(CONCATENATE($K$4,\"2\"),$O$4:$XFD364,ROW()-3,FALSE),\"\")","v":""},{"$nulls":3},{"$f":"IF(OR($E364=\"\",$F364=\"\",O364=\"\",P364=\"\"),\"\",IF(AND(O364=$E364,P364=$F364),Reglement!$S$3*$J364,IF(SIGN($E364-$F364)=SIGN(O364-P364),Reglement!$S$4*$J364,0))*IF(AND($E364+$F364>=6,O364+P364>=6),Reglement!$S$29,IF(AND($E364+$F364>=4,O364+P364>=4),Reglement!$S$28,1)))","v":""}]
[null,null,{"$f":"Score!T224","v":"West Ham"},{"$f":"Score!W224","v":"Watford"},{"$f":"IF(Score!U224<>\"\",Score!U224,\"\")","v":""},{"$f":"IF(Score!V224<>\"\",Score!V224,\"\")","v":""},1,1,1,"",{"$f":"IF($K$4<>0,HLOOKUP($K$4,$O$4:$XFD365,ROW()-3,FALSE),\"\")","v":""},{"$f":"IF($K$4<>0,HLOOKUP(CONCATENATE($K$4,\"1\"),$O$4:$XFD365,ROW()-3,FALSE),\"\")","v":""},{"$f":"IF($K$4<>0,HLOOKUP(CONCATENATE($K$4,\"2\"),$O$4:$XFD365,ROW()-3,FALSE),\"\")","v":""},{"$nulls":3},{"$f":"IF(OR($E365=\"\",$F365=\"\",O365=\"\",P365=\"\"),\"\",IF(AND(O365=$E365,P365=$F365),Reglement!$S$3*$J365,IF(SIGN($E365-$F365)=SIGN(O365-P365),Reglement!$S$4*$J365,0))*IF(AND($E365+$F365>=6,O365+P365>=6),Reglement!$S$29,IF(AND($E365+$F365>=4,O365+P365>=4),Reglement!$S$28,1)))","v":""}]
["JOURNEE n°37",null,{"$f":"Score!T228","v":"Bournemouth"},{"$f":"Score!W228","v":"Southampton"},{"$f":"IF(Score!U228<>\"\",Score!U228,\"\")","v":""},{"$f":"IF(Score!V228<>\"\",Score!V228,\"\")","v":""},1,1,1,"",{"$f":"IF($K$4<>0,HLOOKUP($K$4,$O$4:$XFD366,ROW()-3,FALSE),\"\")","v":""},{"$f":"IF($K$4<>0,HLOOKUP(CONCATENATE($K$4,\"1\"),$O$4:$XFD366,ROW()-3,FALSE),\"\")","v":""},{"$f":"IF($K$4<>0,HLOOKUP(CONCATENATE($K$4,\"2\"),$O$4:$XFD366,ROW()-3,FALSE),\"\")","v":""},{"$nulls":3},{"$f":"IF(OR($E366=\"\",$F366=\"\",O366=\"\",P366=\"\"),\"\",IF(AND(O366=$E366,P366=$F366),Reglement!$S$3*$J366,IF(SIGN($E366-$F366)=SIGN(O366-P366),Reglement!$S$4*$J366,0))*IF(AND($E366+$F366>=6,O366+P366>=6),Reglement!$S$29,IF(AND($E366+$F366>=4,O366+P366>=4),Reglement!$S$28,1)))","v":""}]
[null,null,{"$f":"Score!T229","v":"Aston Villa"},{"$f":"Score!W229","v":"Arsenal"},{"$f":"IF(Score!U229<>\"\",Score!U229,\"\")","v":""},{"$f":"IF(Score!V229<>\"\",Score!V229,\"\")","v":""},1,1,1,{"$f":"IF(OR(E367=\"\",F367=\"\"),\"\",IF(E367>F367,G367,IF(E367=F367,H367,I367)))","v":""},{"$f":"IF($K$4<>0,HLOOKUP($K$4,$O$4:$XFD367,ROW()-3,FALSE),\"\")","v":""},{"$f":"IF($K$4<>0,HLOOKUP(CONCATENATE($K$4,\"1\"),$O$4:$XFD367,ROW()-3,FALSE),\"\")","v":""},{"$f":"IF($K$4<>0,HLOOKUP(CONCATENATE($K$4,\"2\"),$O$4:$XFD367,ROW()-3,FALSE),\"\")","v":""},{"$nulls":3},{"$f":"IF(OR($E367=\"\",$F367=\"\",O367=\"\",P367=\"\"),\"\",IF(AND(O367=$E367,P367=$F367),Reglement!$S$3*$J367,IF(SIGN($E367-$F367)=SIGN(O367-P367),Reglement!$S$4*$J367,0))*IF(AND($E367+$F367>=6,O367+P367>=6),Reglement!$S$29,IF(AND($E367+$F367>=4,O367+P367>=4),Reglement!$S$28,1)))","v":""}]
[null,null,{"$f":"Score!T230","v":"Brighton"},{"$f":"Score!W230","v":"Newcastle"},{"$f":"IF(Score!U230<>\"\",Score!U230,\"\")","v":""},{"$f":"IF(Score!V230<>\"\",Score!V230,\"\")","v":""},1,1,1,"",{"$f":"IF($K$4<>0,HLOOKUP($K$4,$O$4:$XFD368,ROW()-3,FALSE),\"\")","v":""},{"$f":"IF($K$4<>0,HLOOKUP(CONCATENATE($K$4,\"1\"),$O$4:$XFD368,ROW()-3,FALSE),\"\")","v":""},{"$f":"IF($K$4<>0,HLOOKUP(CONCATENATE($K$4,\"2\"),$O$4:$XFD368,ROW()-3,FALSE),\"\")","v":""},{"$nulls":3},{"$f":"IF(OR($E368=\"\",$F368=\"\",O368=\"\",P368=\"\"),\"\",IF(AND(O368=$E368,P368=$F368),Reglement!$S$3*$J368,IF(SIGN($E368-$F368)=SIGN(O368-P368),Reglement!$S$4*$J368,0))*IF(AND($E368+$F368>=6,O368+P368>=6),Reglement!$S$29,IF(AND($E368+$F368>=4,O368+P368>=4),Reglement!$S$28,1)))","v":""}]
[null,null,{"$f":"Score!T231","v":"Liverpool"},{"$f":"Score!W231","v":"Chelsea"},{"$f":"IF(Score!U231<>\"\",Score!U231,\"\")","v":""},{"$f":"IF(Score!V231<>\"\",Score!V231,\"\")","v":""},1,1,1,"",{"$f":"IF($K$4<>0,HLOOKUP($K$4,$O$4:$XFD369,ROW()-3,FALSE),\"\")","v":""},{"$f":"IF($K$4<>0,HLOOKUP(CONCATENATE($K$4,\"1\"),$O$4:$XFD369,ROW()-3,FALSE),\"\")","v":""},{"$f":"IF($K$4<>0,HLOOKUP(CONCATENATE($K$4,\"2\"),$O$4:$XFD369,ROW()-3,FALSE),\"\")","v":""},{"$nulls":3},{"$f":"IF(OR($E369=\"\",$F369=\"\",O369=\"\",P369=\"\"),\"\",IF(AND(O369=$E369,P369=$F369),Reglement!$S$3*$J369,IF(SIGN($E369-$F369)=SIGN(O369-P369),Reglement!$S$4*$J369,0))*IF(AND($E369+$F369>=6,O369+P369>=6),Reglement!$S$29,IF(AND($E369+$F369>=4,O369+P369>=4),Reglement!$S$28,1)))","v":""}]
[null,null,{"$f":"Score!T232","v":"Manchester United"},{"$f":"Score!W232","v":"West Ham"},{"$f":"IF(Score!U232<>\"\",Score!U232,\"\")","v":""},{"$f":"IF(Score!V232<>\"\",Score!V232,\"\")","v":""},1,1,1,"",{"$f":"IF($K$4<>0,HLOOKUP($K$4,$O$4:$XFD370,ROW()-3,FALSE),\"\")","v":""},{"$f":"IF($K$4<>0,HLOOKUP(CONCATENATE($K$4,\"1\"),$O$4:$XFD370,ROW()-3,FALSE),\"\")","v":""},{"$f":"IF($K$4<>0,HLOOKUP(CONCATENATE($K$4,\"2\"),$O$4:$XFD370,ROW()-3,FALSE),\"\")","v":""},{"$nulls":3},{"$f":"IF(OR($E370=\"\",$F370=\"\",O370=\"\",P370=\"\"),\"\",IF(AND(O370=$E370,P370=$F370),Reglement!$S$3*$J370,IF(SIGN($E370-$F370)=SIGN(O370-P370),Reglement!$S$4*$J370,0))*IF(AND($E370+$F370>=6,O370+P370>=6),Reglement!$S$29,IF(AND($E370+$F370>=4,O370+P370>=4),Reglement!$S$28,1)))","v":""}]
[null,null,{"$f":"Score!T233","v":"Norwich"},{"$f":"Score!W233","v":"Burnley"},{"$f":"IF(Score!U233<>\"\",Score!U233,\"\")","v":""},{"$f":"IF(Score!V233<>\"\",Score!V233,\"\")","v":""},1,1,1,"",{"$f":"IF($K$4<>0,HLOOKUP($K$4,$O$4:$XFD371,ROW()-3,FALSE),\"\")","v":""},{"$f":"IF($K$4<>0,HLOOKUP(CONCATENATE($K$4,\"1\"),$O$4:$XFD371,ROW()-3,FALSE),\"\")","v":""},{"$f":"IF($K$4<>0,HLOOKUP(CONCATENATE($K$4,\"2\"),$O$4:$XFD371,ROW()-3,FALSE),\"\")","v":""},{"$nulls":3},{"$f":"IF(OR($E371=\"\",$F371=\"\",O371=\"\",P371=\"\"),\"\",IF(AND(O371=$E371,P371=$F371),Reglement!$S$3*$J371,IF(SIGN($E371-$F371)=SIGN(O371-P371),Reglement!$S$4*$J371,0))*IF(AND($E371+$F371>=6,O371+P371>=6),Reglement!$S$29,IF(AND($E371+$F371>=4,O371+P371>=4),Reglement!$S$28,1)))","v":""}]
[null,null,{"$f":"Score!T234","v":"Sheffield United"},{"$f":"Score!W234","v":"Everton"},{"$f":"IF(Score!U234<>\"\",Score!U234,\"\")","v":""},{"$f":"IF(Score!V234<>\"\",Score!V234,\"\")","v":""},1,1,1,"",{"$f":"IF($K$4<>0,HLOOKUP($K$4,$O$4:$XFD372,ROW()-3,FALSE),\"\")","v":""},{"$f":"IF($K$4<>0,HLOOKUP(CONCATENATE($K$4,\"1\"),$O$4:$XFD372,ROW()-3,FALSE),\"\")","v":""},{"$f":"IF($K$4<>0,HLOOKUP(CONCATENATE($K$4,\"2\"),$O$4:$XFD372,ROW()-3,FALSE),\"\")","v":""},{"$nulls":3},{"$f":"IF(OR($E372=\"\",$F372=\"\",O372=\"\",P372=\"\"),\"\",IF(AND(O372=$E372,P372=$F372),Reglement!$S$3*$J372,IF(SIGN($E372-$F372)=SIGN(O372-P372),Reglement!$S$4*$J372,0))*IF(AND($E372+$F372>=6,O372+P372>=6),Reglement!$S$29,IF(AND($E372+$F372>=4,O372+P372>=4),Reglement!$S$28,1)))","v":""}]
[null,null,{"$f":"Score!T235","v":"Tottenham"},{"$f":"Score!W235","v":"Leicester City"},{"$f":"IF(Score!U235<>\"\",Score!U235,\"\")","v":""},{"$f":"IF(Score!V235<>\"\",Score!V235,\"\")","v":""},1,1,1,{"$f":"IF(OR(E373=\"\",F373=\"\"),\"\",IF(E373>F373,G373,IF(E373=F373,H373,I373)))","v":""},{"$f":"IF($K$4<>0,HLOOKUP($K$4,$O$4:$XFD373,ROW()-3,FALSE),\"\")","v":""},{"$f":"IF($K$4<>0,HLOOKUP(CONCATENATE($K$4,\"1\"),$O$4:$XFD373,ROW()-3,FALSE),\"\")","v":""},{"$f":"IF($K$4<>0,HLOOKUP(CONCATENATE($K$4,\"2\"),$O$4:$XFD373,ROW()-3,FALSE),\"\")","v":""},{"$nulls":3},{"$f":"IF(OR($E373=\"\",$F373=\"\",O373=\"\",P373=\"\"),\"\",IF(AND(O373=$E373,P373=$F373),Reglement!$S$3*$J373,IF(SIGN($E373-$F373)=SIGN(O373-P373),Reglement!$S$4*$J373,0))*IF(AND($E373+$F373>=6,O373+P373>=6),Reglement!$S$29,IF(AND($E373+$F373>=4,O373+P373>=4),Reglement!$S$28,1)))","v":""}]
[null,null,{"$f":"Score!T236","v":"Watford"},{"$f":"Score!W236","v":"Manchester City"},{"$f":"IF(Score!U236<>\"\",Score!U236,\"\")","v":""},{"$f":"IF(Score!V236<>\"\",Score!V236,\"\")","v":""},1,1,1,"",{"$f":"IF($K$4<>0,HLOOKUP($K$4,$O$4:$XFD374,ROW()-3,FALSE),\"\")","v":""},{"$f":"IF($K$4<>0,HLOOKUP(CONCATENATE($K$4,\"1\"),$O$4:$XFD374,ROW()-3,FALSE),\"\")","v":""},{"$f":"IF($K$4<>0,HLOOKUP(CONCATENATE($K$4,\"2\"),$O$4:$XFD374,ROW()-3,FALSE),\"\")","v":""},{"$nulls":3},{"$f":"IF(OR($E374=\"\",$F374=\"\",O374=\"\",P374=\"\"),\"\",IF(AND(O374=$E374,P374=$F374),Reglement!$S$3*$J374,IF(SIGN($E374-$F374)=SIGN(O374-P374),Reglement!$S$4*$J374,0))*IF(AND($E374+$F374>=6,O374+P374>=6),Reglement!$S$29,IF(AND($E374+$F374>=4,O374+P374>=4),Reglement!$S$28,1)))","v":""}]
[null,null,{"$f":"Score!T237","v":"Wolverhampton"},{"$f":"Score!W237","v":"Crystal Palace"},{"$f":"IF(Score!U237<>\"\",Score!U237,\"\")","v":""},{"$f":"IF(Score!V237<>\"\",Score!V237,\"\")","v":""},1,1,1,"",{"$f":"IF($K$4<>0,HLOOKUP($K$4,$O$4:$XFD375,ROW()-3,FALSE),\"\")","v":""},{"$f":"IF($K$4<>0,HLOOKUP(CONCATENATE($K$4,\"1\"),$O$4:$XFD375,ROW()-3,FALSE),\"\")","v":""},{"$f":"IF($K$4<>0,HLOOKUP(CONCATENATE($K$4,\"2\"),$O$4:$XFD375,ROW()-3,FALSE),\"\")","v":""},{"$nulls":3},{"$f":"IF(OR($E375=\"\",$F375=\"\",O375=\"\",P375=\"\"),\"\",IF(AND(O375=$E375,P375=$F375),Reglement!$S$3*$J375,IF(SIGN($E375-$F375)=SIGN(O375-P375),Reglement!$S$4*$J375,0))*IF(AND($E375+$F375>=6,O375+P375>=6),Reglement!$S$29,IF(AND($E375+$F375>=4,O375+P375>=4),Reglement!$S$28,1)))","v":""}]
["JOURNEE n°38",null,{"$f":"Score!T241","v":"Arsenal"},{"$f":"Score!W241","v":"Watford"},{"$f":"IF(Score!U241<>\"\",Score!U241,\"\")","v":""},{"$f":"IF(Score!V241<>\"\",Score!V241,\"\")","v":""},1,1,1,"",{"$f":"IF($K$4<>0,HLOOKUP($K$4,$O$4:$XFD376,ROW()-3,FALSE),\"\")","v":""},{"$f":"IF($K$4<>0,HLOOKUP(CONCATENATE($K$4,\"1\"),$O$4:$XFD376,ROW()-3,FALSE),\"\")","v":""},{"$f":"IF($K$4<>0,HLOOKUP(CONCATENATE($K$4,\"2\"),$O$4:$XFD376,ROW()-3,FALSE),\"\")","v":""},{"$nulls":3},{"$f":"IF(OR($E376=\"\",$F376=\"\",O376=\"\",P376=\"\"),\"\",IF(AND(O376=$E376,P376=$F376),Reglement!$S$3*$J376,IF(SIGN($E376-$F376)=SIGN(O376-P376),Reglement!$S$4*$J376,0))*IF(AND($E376+$F376>=6,O376+P376>=6),Reglement!$S$29,IF(AND($E376+$F376>=4,O376+P376>=4),Reglement!$S$28,1)))","v":""}]
[null,null,{"$f":"Score!T242","v":"Burnley"},{"$f":"Score!W242","v":"Brighton"},{"$f":"IF(Score!U242<>\"\",Score!U242,\"\")","v":""},{"$f":"IF(Score!V242<>\"\",Score!V242,\"\")","v":""},1,1,1,"",{"$f":"IF($K$4<>0,HLOOKUP($K$4,$O$4:$XFD377,ROW()-3,FALSE),\"\")","v":""},{"$f":"IF($K$4<>0,HLOOKUP(CONCATENATE($K$4,\"1\"),$O$4:$XFD377,ROW()-3,FALSE),\"\")","v":""},{"$f":"IF($K$4<>0,HLOOKUP(CONCATENATE($K$4,\"2\"),$O$4:$XFD377,ROW()-3,FALSE),\"\")","v":""},{"$nulls":3},{"$f":"IF(OR($E377=\"\",$F377=\"\",O377=\"\",P377=\"\"),\"\",IF(AND(O377=$E377,P377=$F377),Reglement!$S$3*$J377,IF(SIGN($E377-$F377)=SIGN(O377-P377),Reglement!$S$4*$J377,0))*IF(AND($E377+$F377>=6,O377+P377>=6),Reglement!$S$29,IF(AND($E377+$F377>=4,O377+P377>=4),Reglement!$S$28,1)))","v":""}]
[null,null,{"$f":"Score!T243","v":"Chelsea"},{"$f":"Score!W243","v":"Wolverhampton"},{"$f":"IF(Score!U243<>\"\",Score!U243,\"\")","v":""},{"$f":"IF(Score!V243<>\"\",Score!V243,\"\")","v":""},1,1,1,"",{"$f":"IF($K$4<>0,HLOOKUP($K$4,$O$4:$XFD378,ROW()-3,FALSE),\"\")","v":""},{"$f":"IF($K$4<>0,HLOOKUP(CONCATENATE($K$4,\"1\"),$O$4:$XFD378,ROW()-3,FALSE),\"\")","v":""},{"$f":"IF($K$4<>0,HLOOKUP(CONCATENATE($K$4,\"2\"),$O$4:$XFD378,ROW()-3,FALSE),\"\")","v":""},{"$nulls":3},{"$f":"IF(OR($E378=\"\",$F378=\"\",O378=\"\",P378=\"\"),\"\",IF(AND(O378=$E378,P378=$F378),Reglement!$S$3*$J378,IF(SIGN($E378-$F378)=SIGN(O378-P378),Reglement!$S$4*$J378,0))*IF(AND($E378+$F378>=6,O378+P378>=6),Reglement!$S$29,IF(AND($E378+$F378>=4,O378+P378>=4),Reglement!$S$28,1)))","v":""}]
[null,null,{"$f":"Score!T244","v":"Crystal Palace"},{"$f":"Score!W244","v":"Tottenham"},{"$f":"IF(Score!U244<>\"\",Score!U244,\"\")","v":""},{"$f":"IF(Score!V244<>\"\",Score!V244,\"\")","v":""},1,1,1,"",{"$f":"IF($K$4<>0,HLOOKUP($K$4,$O$4:$XFD379,ROW()-3,FALSE),\"\")","v":""},{"$f":"IF($K$4<>0,HLOOKUP(CONCATENATE($K$4,\"1\"),$O$4:$XFD379,ROW()-3,FALSE),\"\")","v":""},{"$f":"IF($K$4<>0,HLOOKUP(CONCATENATE($K$4,\"2\"),$O$4:$XFD379,ROW()-3,FALSE),\"\")","v":""},{"$nulls":3},{"$f":"IF(OR($E379=\"\",$F379=\"\",O379=\"\",P379=\"\"),\"\",IF(AND(O379=$E379,P379=$F379),Reglement!$S$3*$J379,IF(SIGN($E379-$F379)=SIGN(O379-P379),Reglement!$S$4*$J379,0))*IF(AND($E379+$F379>=6,O379+P379>=6),Reglement!$S$29,IF(AND($E379+$F379>=4,O379+P379>=4),Reglement!$S$28,1)))","v":""}]
[null,null,{"$f":"Score!T245","v":"Everton"},{"$f":"Score!W245","v":"Bournemouth"},{"$f":"IF(Score!U245<>\"\",Score!U245,\"\")","v":""},{"$f":"IF(Score!V245<>\"\",Score!V245,\"\")","v":""},1,1,1,"",{"$f":"IF($K$4<>0,HLOOKUP($K$4,$O$4:$XFD380,ROW()-3,FALSE),\"\")","v":""},{"$f":"IF($K$4<>0,HLOOKUP(CONCATENATE($K$4,\"1\"),$O$4:$XFD380,ROW()-3,FALSE),\"\")","v":""},{"$f":"IF($K$4<>0,HLOOKUP(CONCATENATE($K$4,\"2\"),$O$4:$XFD380,ROW()-3,FALSE),\"\")","v":""},{"$nulls":3},{"$f":"IF(OR($E380=\"\",$F380=\"\",O380=\"\",P380=\"\"),\"\",IF(AND(O380=$E380,P380=$F380),Reglement!$S$3*$J380,IF(SIGN($E380-$F380)=SIGN(O380-P380),Reglement!$S$4*$J380,0))*IF(AND($E380+$F380>=6,O380+P380>=6),Reglement!$S$29,IF(AND($E380+$F380>=4,O380+P380>=4),Reglement!$S$28,1)))","v":""}]
[null,null,{"$f":"Score!T246","v":"Leicester City"},{"$f":"Score!W246","v":"Manchester United"},{"$f":"IF(Score!U246<>\"\",Score!U246,\"\")","v":""},{"$f":"IF(Score!V246<>\"\",Score!V246,\"\")","v":""},1,1,1,"",{"$f":"IF($K$4<>0,HLOOKUP($K$4,$O$4:$XFD381,ROW()-3,FALSE),\"\")","v":""},{"$f":"IF($K$4<>0,HLOOKUP(CONCATENATE($K$4,\"1\"),$O$4:$XFD381,ROW()-3,FALSE),\"\")","v":""},{"$f":"IF($K$4<>0,HLOOKUP(CONCATENATE($K$4,\"2\"),$O$4:$XFD381,ROW()-3,FALSE),\"\")","v":""},{"$nulls":3},{"$f":"IF(OR($E381=\"\",$F381=\"\",O381=\"\",P381=\"\"),\"\",IF(AND(O381=$E381,P381=$F381),Reglement!$S$3*$J381,IF(SIGN($E381-$F381)=SIGN(O381-P381),Reglement!$S$4*$J381,0))*IF(AND($E381+$F381>=6,O381+P381>=6),Reglement!$S$29,IF(AND($E381+$F381>=4,O381+P381>=4),Reglement!$S$28,1)))","v":""}]
[null,null,{"$f":"Score!T247","v":"Manchester City"},{"$f":"Score!W247","v":"Norwich"},{"$f":"IF(Score!U247<>\"\",Score!U247,\"\")","v":""},{"$f":"IF(Score!V247<>\"\",Score!V247,\"\")","v":""},1,1,1,"",{"$f":"IF($K$4<>0,HLOOKUP($K$4,$O$4:$XFD382,ROW()-3,FALSE),\"\")","v":""},{"$f":"IF($K$4<>0,HLOOKUP(CONCATENATE($K$4,\"1\"),$O$4:$XFD382,ROW()-3,FALSE),\"\")","v":""},{"$f":"IF($K$4<>0,HLOOKUP(CONCATENATE($K$4,\"2\"),$O$4:$XFD382,ROW()-3,FALSE),\"\")","v":""},{"$nulls":3},{"$f":"IF(OR($E382=\"\",$F382=\"\",O382=\"\",P382=\"\"),\"\",IF(AND(O382=$E382,P382=$F382),Reglement!$S$3*$J382,IF(SIGN($E382-$F382)=SIGN(O382-P382),Reglement!$S$4*$J382,0))*IF(AND($E382+$F382>=6,O382+P382>=6),Reglement!$S$29,IF(AND($E382+$F382>=4,O382+P382>=4),Reglement!$S$28,1)))","v":""}]
[null,null,{"$f":"Score!T248","v":"Newcastle"},{"$f":"Score!W248","v":"Liverpool"},{"$f":"IF(Score!U248<>\"\",Score!U248,\"\")","v":""},{"$f":"IF(Score!V248<>\"\",Score!V248,\"\")","v":""},1,1,1,"",{"$f":"IF($K$4<>0,HLOOKUP($K$4,$O$4:$XFD383,ROW()-3,FALSE),\"\")","v":""},{"$f":"IF($K$4<>0,HLOOKUP(CONCATENATE($K$4,\"1\"),$O$4:$XFD383,ROW()-3,FALSE),\"\")","v":""},{"$f":"IF($K$4<>0,HLOOKUP(CONCATENATE($K$4,\"2\"),$O$4:$XFD383,ROW()-3,FALSE),\"\")","v":""},{"$nulls":3},{"$f":"IF(OR($E383=\"\",$F383=\"\",O383=\"\",P383=\"\"),\"\",IF(AND(O383=$E383,P383=$F383),Reglement!$S$3*$J383,IF(SIGN($E383-$F383)=SIGN(O383-P383),Reglement!$S$4*$J383,0))*IF(AND($E383+$F383>=6,O383+P383>=6),Reglement!$S$29,IF(AND($E383+$F383>=4,O383+P383>=4),Reglement!$S$28,1)))","v":""}]
[null,null,{"$f":"Score!T249","v":"Southampton"},{"$f":"Score!W249","v":"Sheffield United"},{"$f":"IF(Score!U249<>\"\",Score!U249,\"\")","v":""},{"$f":"IF(Score!V249<>\"\",Score!V249,\"\")","v":""},1,1,1,"",{"$f":"IF($K$4<>0,HLOOKUP($K$4,$O$4:$XFD384,ROW()-3,FALSE),\"\")","v":""},{"$f":"IF($K$4<>0,HLOOKUP(CONCATENATE($K$4,\"1\"),$O$4:$XFD384,ROW()-3,FALSE),\"\")","v":""},{"$f":"IF($K$4<>0,HLOOKUP(CONCATENATE($K$4,\"2\"),$O$4:$XFD384,ROW()-3,FALSE),\"\")","v":""},{"$nulls":3},{"$f":"IF(OR($E384=\"\",$F384=\"\",O384=\"\",P384=\"\"),\"\",IF(AND(O384=$E384,P384=$F384),Reglement!$S$3*$J384,IF(SIGN($E384-$F384)=SIGN(O384-P384),Reglement!$S$4*$J384,0))*IF(AND($E384+$F384>=6,O384+P384>=6),Reglement!$S$29,IF(AND($E384+$F384>=4,O384+P384>=4),Reglement!$S$28,1)))","v":""}]
[null,null,{"$f":"Score!T250","v":"West Ham"},{"$f":"Score!W250","v":"Aston Villa"},{"$f":"IF(Score!U250<>\"\",Score!U250,\"\")","v":""},{"$f":"IF(Score!V250<>\"\",Score!V250,\"\")","v":""},1,1,1,"",{"$f":"IF($K$4<>0,HLOOKUP($K$4,$O$4:$XFD385,ROW()-3,FALSE),\"\")","v":""},{"$f":"IF($K$4<>0,HLOOKUP(CONCATENATE($K$4,\"1\"),$O$4:$XFD385,ROW()-3,FALSE),\"\")","v":""},{"$f":"IF($K$4<>0,HLOOKUP(CONCATENATE($K$4,\"2\"),$O$4:$XFD385,ROW()-3,FALSE),\"\")","v":""},{"$nulls":3},{"$f":"IF(OR($E385=\"\",$F385=\"\",O385=\"\",P385=\"\"),\"\",IF(AND(O385=$E385,P385=$F385),Reglement!$S$3*$J385,IF(SIGN($E385-$F385)=SIGN(O385-P385),Reglement!$S$4*$J385,0))*IF(AND($E385+$F385>=6,O385+P385>=6),Reglement!$S$29,IF(AND($E385+$F385>=4,O385+P385>=4),Reglement!$S$28,1)))","v":""}]
[{"$nulls":16},{"$f":"RANK(Q390,$O$390:$XFD$390)","v":1}]
[null,null,"Joueur",{"$nulls":13},{"$f":"RANK(Q433,$O$433:$XFD$433,1)","v":1}]
[null,null,"Calc",{"$nulls":13},{"$f":"O3*1000-Q387","v":-1}]
[null,null,"RANG",{"$nulls":13},{"$f":"RANK(Q388,$O$388:$XFD$388)","v":1}]
[null,null,"SCORE",{"$nulls":13},{"$f":"O3","v":0}]
[null,null,"NOM",{"$nulls":13},{"$f":"O2","v":0}]
[null,null,"EQUIPE",{"$nulls":9},{"$f":"SUM(IF(FREQUENCY(IF(LEN(Q392:XFD392)>0,MATCH(Q392:XFD392,Q392:XFD392,0),\"\"),IF(LEN(Q392:XFD392)>0,MATCH(Q392:XFD392,Q392:XFD392,0),\"\"))>0,1))","v":0},{"$nulls":3},{"$f":"IF(O5<>\"\",O5,\"\")","v":""}]
[null,null,"Fiabilité",{"$nulls":13},{"$f":"IF(COUNTBLANK(Q6:Q385)<>380,(COUNTIF(Q6:Q385,\">0\")/(380-COUNTBLANK(Q6:Q385))),1)","v":{"v":1,"d":"100.00%"}}]
[null,null,"Points J1",{"$nulls":8},{"$f":"COUNTIF(E6:F15,\"\")","v":20},{"$f":"IF(OR(MAX(Q394:$XFD394)=0,L394>0),\"\",MAX(Q394:$XFD394))","v":""},{"$nulls":3},{"$f":"SUM(Q6:Q15)","v":0}]
[null,null,"Points J2",{"$nulls":8},{"$f":"COUNTIF(E16:F25,\"\")","v":20},{"$f":"IF(OR(MAX(Q395:$XFD395)=0,L395>0),\"\",MAX(Q395:$XFD395))","v":""},{"$nulls":3},{"$f":"SUM(Q16:Q25)","v":0}]
[null,null,"Points J3",{"$nulls":8},{"$f":"COUNTIF(E26:F35,\"\")","v":20},{"$f":"IF(OR(MAX(Q396:$XFD396)=0,L396>0),\"\",MAX(Q396:$XFD396))","v":""},{"$nulls":3},{"$f":"SUM(Q26:Q35)","v":0}]
[null,null,"Points J4",{"$nulls":8},{"$f":"COUNTIF(E36:F45,\"\")","v":20},{"$f":"IF(OR(MAX(Q397:$XFD397)=0,L397>0),\"\",MAX(Q397:$XFD397))","v":""},{"$nulls":3},{"$f":"SUM(Q36:Q45)","v":0}]
[null,null,"Points J5",{"$nulls":8},{"$f":"COUNTIF(E46:F55,\"\")","v":20},{"$f":"IF(OR(MAX(Q398:$XFD398)=0,L398>0),\"\",MAX(Q398:$XFD398))","v":""},{"$nulls":3},{"$f":"SUM(Q46:Q55)","v":0}]
[null,null,"Points J6",{"$nulls":8},{"$f":"COUNTIF(E56:F65,\"\")","v":20},{"$f":"IF(OR(MAX(Q399:$XFD399)=0,L399>0),\"\",MAX(Q399:$XFD399))","v":""},{"$nulls":3},{"$f":"SUM(Q56:Q65)","v":0}]
[null,null,"Points J7",{"$nulls":8},{"$f":"COUNTIF(E66:F75,\"\")","v":20},{"$f":"IF(OR(MAX(Q400:$XFD400)=0,L400>0),\"\",MAX(Q400:$XFD400))","v":""},{"$nulls":3},{"$f":"SUM(Q66:Q75)","v":0}]
[null,null,"Points J8",{"$nulls":8},{"$f":"COUNTIF(E76:F85,\"\")","v":20},{"$f":"IF(OR(MAX(Q401:$XFD401)=0,L401>0),\"\",MAX(Q401:$XFD401))","v":""},{"$nulls":3},{"$f":"SUM(Q76:Q85)","v":0}]
[null,null,"Points J9",{"$nulls":8},{"$f":"COUNTIF(E86:F95,\"\")","v":20},{"$f":"IF(OR(MAX(Q402:$XFD402)=0,L402>0),\"\",MAX(Q402:$XFD402))","v":""},{"$nulls":3},{"$f":"SUM(Q86:Q95)","v":0}]
[null,null,"Points J10",{"$nulls":8},{"$f":"COUNTIF(E96:F105,\"\")","v":20},{"$f":"IF(OR(MAX(Q403:$XFD403)=0,L403>0),\"\",MAX(Q403:$XFD403))","v":""},{"$nulls":3},{"$f":"SUM(Q96:Q105)","v":0}]
[null,null,"Points J11",{"$nulls":8},{"$f":"COUNTIF(E106:F115,\"\")","v":20},{"$f":"IF(OR(MAX(Q404:$XFD404)=0,L404>0),\"\",MAX(Q404:$XFD404))","v":""},{"$nulls":3},{"$f":"SUM(Q106:Q115)","v":0}]
[null,null,"Points J12",{"$nulls":8},{"$f":"COUNTIF(E116:F125,\"\")","v":20},{"$f":"IF(OR(MAX(Q405:$XFD405)=0,L405>0),\"\",MAX(Q405:$XFD405))","v":""},{"$nulls":3},{"$f":"SUM(Q116:Q125)","v":0}]
[null,null,"Points J13",{"$nulls":8},{"$f":"COUNTIF(E126:F135,\"\")","v":20},{"$f":"IF(OR(MAX(Q406:$XFD406)=0,L406>0),\"\",MAX(Q406:$XFD406))","v":""},{"$nulls":3},{"$f":"SUM(Q126:Q135)","v":0}]
[null,null,"Points J14",{"$nulls":8},{"$f":"COUNTIF(E136:F145,\"\")","v":20},{"$f":"IF(OR(MAX(Q407:$XFD407)=0,L407>0),\"\",MAX(Q407:$XFD407))","v":""},{"$nulls":3},{"$f":"SUM(Q136:Q145)","v":0}]
[null,null,"Points J15",{"$nulls":8},{"$f":"COUNTIF(E146:F155,\"\")","v":20},{"$f":"IF(OR(MAX(Q408:$XFD408)=0,L408>0),\"\",MAX(Q408:$XFD408))","v":""},{"$nulls":3},{"$f":"SUM(Q146:Q155)","v":0}]
[null,null,"Points J16",{"$nulls":8},{"$f":"COUNTIF(E156:F165,\"\")","v":20},{"$f":"IF(OR(MAX(Q409:$XFD409)=0,L409>0),\"\",MAX(Q409:$XFD409))","v":""},{"$nulls":3},{"$f":"SUM(Q156:Q165)","v":0}]
[null,null,"Points J17",{"$nulls":8},{"$f":"COUNTIF(E166:F175,\"\")","v":20},{"$f":"IF(OR(MAX(Q410:$XFD410)=0,L410>0),\"\",MAX(Q410:$XFD410))","v":""},{"$nulls":3},{"$f":"SUM(Q166:Q175)","v":0}]
[null,null,"Points J18",{"$nulls":8},{"$f":"COUNTIF(E176:F185,\"\")","v":20},{"$f":"IF(OR(MAX(Q411:$XFD411)=0,L411>0),\"\",MAX(Q411:$XFD411))","v":""},{"$nulls":3},{"$f":"SUM(Q176:Q185)","v":0}]
[null,null,"Points J19",{"$nulls":8},{"$f":"COUNTIF(E186:F195,\"\")","v":20},{"$f":"IF(OR(MAX(Q412:$XFD412)=0,L412>0),\"\",MAX(Q412:$XFD412))","v":""},{"$nulls":3},{"$f":"SUM(Q186:Q195)","v":0}]
[null,null,"Points J20",{"$nulls":8},{"$f":"COUNTIF(E196:F205,\"\")","v":20},{"$f":"IF(OR(MAX(Q413:$XFD413)=0,L413>0),\"\",MAX(Q413:$XFD413))","v":""},{"$nulls":3},{"$f":"SUM(Q196:Q205)","v":0}]
[null,null,"Points J21",{"$nulls":8},{"$f":"COUNTIF(E206:F215,\"\")","v":20},{"$f":"IF(OR(MAX(Q414:$XFD414)=0,L414>0),\"\",MAX(Q414:$XFD414))","v":""},{"$nulls":3},{"$f":"SUM(Q206:Q215)","v":0}]
[null,null,"Points J22",{"$nulls":8},{"$f":"COUNTIF(E216:F225,\"\")","v":20},{"$f":"IF(OR(MAX(Q415:$XFD415)=0,L415>0),\"\",MAX(Q415:$XFD415))","v":""},{"$nulls":3},{"$f":"SUM(Q216:Q225)","v":0}]
[null,null,"Points J23",{"$nulls":8},{"$f":"COUNTIF(E226:F235,\"\")","v":20},{"$f":"IF(OR(MAX(Q416:$XFD416)=0,L416>0),\"\",MAX(Q416:$XFD416))","v":""},{"$nulls":3},{"$f":"SUM(Q226:Q235)","v":0}]
[null,null,"Points J24",{"$nulls":8},{"$f":"COUNTIF(E236:F245,\"\")","v":20},{"$f":"IF(OR(MAX(Q417:$XFD417)=0,L417>0),\"\",MAX(Q417:$XFD417))","v":""},{"$nulls":3},{"$f":"SUM(Q236:Q245)","v":0}]
[null,null,"Points J25",{"$nulls":8},{"$f":"COUNTIF(E246:F255,\"\")","v":20},{"$f":"IF(OR(MAX(Q418:$XFD418)=0,L418>0),\"\",MAX(Q418:$XFD418))","v":""},{"$nulls":3},{"$f":"SUM(Q246:Q255)","v":0}]
[null,null,"Points J26",{"$nulls":8},{"$f":"COUNTIF(E256:F265,\"\")","v":20},{"$f":"IF(OR(MAX(Q419:$XFD419)=0,L419>0),\"\",MAX(Q419:$XFD419))","v":""},{"$nulls":3},{"$f":"SUM(Q256:Q265)","v":0}]
[null,null,"Points J27",{"$nulls":8},{"$f":"COUNTIF(E266:F275,\"\")","v":20},{"$f":"IF(OR(MAX(Q420:$XFD420)=0,L420>0),\"\",MAX(Q420:$XFD420))","v":""},{"$nulls":3},{"$f":"SUM(Q266:Q275)","v":0}]
[null,null,"Points J28",{"$nulls":8},{"$f":"COUNTIF(E276:F285,\"\")","v":20},{"$f":"IF(OR(MAX(Q421:$XFD421)=0,L421>0),\"\",MAX(Q421:$XFD421))","v":""},{"$nulls":3},{"$f":"SUM(Q276:Q285)","v":0}]
[null,null,"Points J29",{"$nulls":8},{"$f":"COUNTIF(E286:F295,\"\")","v":20},{"$f":"IF(OR(MAX(Q422:$XFD422)=0,L422>0),\"\",MAX(Q422:$XFD422))","v":""},{"$nulls":3},{"$f":"SUM(Q286:Q295)","v":0}]
[null,null,"Points J30",{"$nulls":8},{"$f":"COUNTIF(E296:F305,\"\")","v":20},{"$f":"IF(OR(MAX(Q423:$XFD423)=0,L423>0),\"\",MAX(Q423:$XFD423))","v":""},{"$nulls":3},{"$f":"SUM(Q296:Q305)","v":0}]
[null,null,"Points J31",{"$nulls":8},{"$f":"COUNTIF(E306:F315,\"\")","v":20},{"$f":"IF(OR(MAX(Q424:$XFD424)=0,L424>0),\"\",MAX(Q424:$XFD424))","v":""},{"$nulls":3},{"$f":"SUM(Q306:Q315)","v":0}]
[null,null,"Points J32",{"$nulls":8},{"$f":"COUNTIF(E316:F325,\"\")","v":20},{"$f":"IF(OR(MAX(Q425:$XFD425)=0,L425>0),\"\",MAX(Q425:$XFD425))","v":""},{"$nulls":3},{"$f":"SUM(Q316:Q325)","v":0}]
[null,null,"Points J33",{"$nulls":8},{"$f":"COUNTIF(E326:F335,\"\")","v":20},{"$f":"IF(OR(MAX(Q426:$XFD426)=0,L426>0),\"\",MAX(Q426:$XFD426))","v":""},{"$nulls":3},{"$f":"SUM(Q326:Q335)","v":0}]
[null,null,"Points J34",{"$nulls":8},{"$f":"COUNTIF(E336:F345,\"\")","v":20},{"$f":"IF(OR(MAX(Q427:$XFD427)=0,L427>0),\"\",MAX(Q427:$XFD427))","v":""},{"$nulls":3},{"$f":"SUM(Q336:Q345)","v":0}]
[null,null,"Points J35",{"$nulls":8},{"$f":"COUNTIF(E346:F355,\"\")","v":20},{"$f":"IF(OR(MAX(Q428:$XFD428)=0,L428>0),\"\",MAX(Q428:$XFD428))","v":""},{"$nulls":3},{"$f":"SUM(Q346:Q355)","v":0}]
[null,null,"Points J36",{"$nulls":8},{"$f":"COUNTIF(E356:F365,\"\")","v":20},{"$f":"IF(OR(MAX(Q429:$XFD429)=0,L429>0),\"\",MAX(Q429:$XFD429))","v":""},{"$nulls":3},{"$f":"SUM(Q356:Q365)","v":0}]
[null,null,"Points J37",{"$nulls":8},{"$f":"COUNTIF(E366:F375,\"\")","v":20},{"$f":"IF(OR(MAX(Q430:$XFD430)=0,L430>0),\"\",MAX(Q430:$XFD430))","v":""},{"$nulls":3},{"$f":"SUM(Q366:Q375)","v":0}]
[null,null,"Points J38",{"$nulls":8},{"$f":"COUNTIF(E376:F385,\"\")","v":20},{"$f":"IF(OR(MAX(Q431:$XFD431)=0,L431>0),\"\",MAX(Q431:$XFD431))","v":""},{"$nulls":3},{"$f":"SUM(Q376:Q385)","v":0}]
[null,null,"R.O.I",{"$nulls":13},{"$f":"SUMIF(Q6:Q385,\">0\",$J$6:$J$385)-P438","v":0}]
[null,null,"Colonne",{"$nulls":13},{"$f":"COLUMN(Q390)","v":17}]
[null,null,"Journées Gagnées",{"$nulls":13},{"$f":"SUMPRODUCT(($M$394:$M$431=Q394:Q431)*($M$394:$M$431<>\"\"))","v":0}]
[null,null,"Record / Match",{"$nulls":13},{"$f":"MAX(Q6:Q385)","v":0}]
[null,null,"Record / Journée",{"$nulls":13},{"$f":"MAX(Q394:Q431)","v":0}]
[null,null,"Tout pile",{"$nulls":13},{"$f":"SUMPRODUCT((O6:O385=$E$6:$E$385)*($F$6:$F$385=P6:P385)*(O6:O385<>\"\"))","v":0}]
[null,null,"Bons pronostics",{"$nulls":11},{"$f":"COUNTIF(Q6:Q385,\">0\")","v":0},{"$f":"380-COUNTBLANK(Q6:Q385)","v":0},{"$f":"O438&\" / \"&P438","v":"0 / 0"}]
[null,null,"Bonus (bons pronos /10)",{"$nulls":13},{"$f":"COUNTIF(P440:P477,6)*Reglement!$R$42+COUNTIF(P440:P477,7)*Reglement!$R$43+COUNTIF(P440:P477,8)*Reglement!$R$44+COUNTIF(P440:P477,9)*Reglement!$R$45+COUNTIF(P440:P477,10)*Reglement!$R$46","v":0}]
[null,null,"Classement J1",{"$nulls":12},{"$f":"COUNTIF(Q6:Q15,\">0\")","v":0},{"$f":"IF(AND($M$394<>\"\",Q394>0),RANK(Q394,$Q$394:$XFD$394),\"\")","v":""}]
[null,null,"Classement J2",{"$nulls":12},{"$f":"COUNTIF(Q16:Q25,\">0\")","v":0},{"$f":"IF(AND($M$395<>\"\",Q395>0),RANK(Q395,$Q$395:$XFD$395),\"\")","v":""}]
[null,null,"Classement J3",{"$nulls":12},{"$f":"COUNTIF(Q26:Q35,\">0\")","v":0},{"$f":"IF(AND($M$396<>\"\",Q396>0),RANK(Q396,$Q$396:$XFD$396),\"\")","v":""}]
[null,null,"Classement J4",{"$nulls":12},{"$f":"COUNTIF(Q36:Q45,\">0\")","v":0},{"$f":"IF(AND($M$397<>\"\",Q397>0),RANK(Q397,$Q$397:$XFD$397),\"\")","v":""}]
[null,null,"Classement J5",{"$nulls":12},{"$f":"COUNTIF(Q46:Q55,\">0\")","v":0},{"$f":"IF(AND($M$398<>\"\",Q398>0),RANK(Q398,$Q$398:$XFD$398),\"\")","v":""}]
[null,null,"Classement J6",{"$nulls":12},{"$f":"COUNTIF(Q56:Q65,\">0\")","v":0},{"$f":"IF(AND($M$399<>\"\",Q399>0),RANK(Q399,$Q$399:$XFD$399),\"\")","v":""}]
[null,null,"Classement J7",{"$nulls":12},{"$f":"COUNTIF(Q66:Q75,\">0\")","v":0},{"$f":"IF(AND($M$400<>\"\",Q400>0),RANK(Q400,$Q$400:$XFD$400),\"\")","v":""}]
[null,null,"Classement J8",{"$nulls":12},{"$f":"COUNTIF(Q76:Q85,\">0\")","v":0},{"$f":"IF(AND($M$401<>\"\",Q401>0),RANK(Q401,$Q$401:$XFD$401),\"\")","v":""}]
[null,null,"Classement J9",{"$nulls":12},{"$f":"COUNTIF(Q86:Q95,\">0\")","v":0},{"$f":"IF(AND($M$402<>\"\",Q402>0),RANK(Q402,$Q$402:$XFD$402),\"\")","v":""}]
[null,null,"Classement J10",{"$nulls":12},{"$f":"COUNTIF(Q96:Q105,\">0\")","v":0},{"$f":"IF(AND($M$403<>\"\",Q403>0),RANK(Q403,$Q$403:$XFD$403),\"\")","v":""}]
[null,null,"Classement J11",{"$nulls":12},{"$f":"COUNTIF(Q106:Q115,\">0\")","v":0},{"$f":"IF(AND($M$404<>\"\",Q404>0),RANK(Q404,$Q$404:$XFD$404),\"\")","v":""}]
[null,null,"Classement J12",{"$nulls":12},{"$f":"COUNTIF(Q116:Q125,\">0\")","v":0},{"$f":"IF(AND($M$405<>\"\",Q405>0),RANK(Q405,$Q$405:$XFD$405),\"\")","v":""}]
[null,null,"Classement J13",{"$nulls":12},{"$f":"COUNTIF(Q126:Q135,\">0\")","v":0},{"$f":"IF(AND($M$406<>\"\",Q406>0),RANK(Q406,$Q$406:$XFD$406),\"\")","v":""}]
[null,null,"Classement J14",{"$nulls":12},{"$f":"COUNTIF(Q136:Q145,\">0\")","v":0},{"$f":"IF(AND($M$407<>\"\",Q407>0),RANK(Q407,$Q$407:$XFD$407),\"\")","v":""}]
[null,null,"Classement J15",{"$nulls":12},{"$f":"COUNTIF(Q146:Q155,\">0\")","v":0},{"$f":"IF(AND($M$408<>\"\",Q408>0),RANK(Q408,$Q$408:$XFD$408),\"\")","v":""}]
[null,null,"Classement J16",{"$nulls":12},{"$f":"COUNTIF(Q156:Q165,\">0\")","v":0},{"$f":"IF(AND($M$409<>\"\",Q409>0),RANK(Q409,$Q$409:$XFD$409),\"\")","v":""}]
[null,null,"Classement J17",{"$nulls":12},{"$f":"COUNTIF(Q166:Q175,\">0\")","v":0},{"$f":"IF(AND($M$410<>\"\",Q410>0),RANK(Q410,$Q$410:$XFD$410),\"\")","v":""}]
[null,null,"Classement J18",{"$nulls":12},{"$f":"COUNTIF(Q176:Q185,\">0\")","v":0},{"$f":"IF(AND($M$411<>\"\",Q411>0),RANK(Q411,$Q$411:$XFD$411),\"\")","v":""}]
[null,null,"Classement J19",{"$nulls":12},{"$f":"COUNTIF(Q186:Q195,\">0\")","v":0},{"$f":"IF(AND($M$412<>\"\",Q412>0),RANK(Q412,$Q$412:$XFD$412),\"\")","v":""}]
[null,null,"Classement J20",{"$nulls":12},{"$f":"COUNTIF(Q196:Q205,\">0\")","v":0},{"$f":"IF(AND($M$413<>\"\",Q413>0),RANK(Q413,$Q$413:$XFD$413),\"\")","v":""}]
[null,null,"Classement J21",{"$nulls":12},{"$f":"COUNTIF(Q206:Q215,\">0\")","v":0},{"$f":"IF(AND($M$414<>\"\",Q414>0),RANK(Q414,$Q$414:$XFD$414),\"\")","v":""}]
[null,null,"Classement J22",{"$nulls":12},{"$f":"COUNTIF(Q216:Q225,\">0\")","v":0},{"$f":"IF(AND($M$415<>\"\",Q415>0),RANK(Q415,$Q$415:$XFD$415),\"\")","v":""}]
[null,null,"Classement J23",{"$nulls":12},{"$f":"COUNTIF(Q226:Q235,\">0\")","v":0},{"$f":"IF(AND($M$416<>\"\",Q416>0),RANK(Q416,$Q$416:$XFD$416),\"\")","v":""}]
[null,null,"Classement J24",{"$nulls":12},{"$f":"COUNTIF(Q236:Q245,\">0\")","v":0},{"$f":"IF(AND($M$417<>\"\",Q417>0),RANK(Q417,$Q$417:$XFD$417),\"\")","v":""}]
[null,null,"Classement J25",{"$nulls":12},{"$f":"COUNTIF(Q246:Q255,\">0\")","v":0},{"$f":"IF(AND($M$418<>\"\",Q418>0),RANK(Q418,$Q$418:$XFD$418),\"\")","v":""}]
[null,null,"Classement J26",{"$nulls":12},{"$f":"COUNTIF(Q256:Q265,\">0\")","v":0},{"$f":"IF(AND($M$419<>\"\",Q419>0),RANK(Q419,$Q$419:$XFD$419),\"\")","v":""}]
[null,null,"Classement J27",{"$nulls":12},{"$f":"COUNTIF(Q266:Q275,\">0\")","v":0},{"$f":"IF(AND($M$420<>\"\",Q420>0),RANK(Q420,$Q$420:$XFD$420),\"\")","v":""}]
[null,null,"Classement J28",{"$nulls":12},{"$f":"COUNTIF(Q276:Q285,\">0\")","v":0},{"$f":"IF(AND($M$421<>\"\",Q421>0),RANK(Q421,$Q$421:$XFD$421),\"\")","v":""}]
[null,null,"Classement J29",{"$nulls":12},{"$f":"COUNTIF(Q286:Q295,\">0\")","v":0},{"$f":"IF(AND($M$422<>\"\",Q422>0),RANK(Q422,$Q$422:$XFD$422),\"\")","v":""}]
[null,null,"Classement J30",{"$nulls":12},{"$f":"COUNTIF(Q296:Q305,\">0\")","v":0},{"$f":"IF(AND($M$423<>\"\",Q423>0),RANK(Q423,$Q$423:$XFD$423),\"\")","v":""}]
[null,null,"Classement J31",{"$nulls":12},{"$f":"COUNTIF(Q306:Q315,\">0\")","v":0},{"$f":"IF(AND($M$424<>\"\",Q424>0),RANK(Q424,$Q$424:$XFD$424),\"\")","v":""}]
[null,null,"Classement J32",{"$nulls":12},{"$f":"COUNTIF(Q316:Q325,\">0\")","v":0},{"$f":"IF(AND($M$425<>\"\",Q425>0),RANK(Q425,$Q$425:$XFD$425),\"\")","v":""}]
[null,null,"Classement J33",{"$nulls":12},{"$f":"COUNTIF(Q326:Q335,\">0\")","v":0},{"$f":"IF(AND($M$426<>\"\",Q426>0),RANK(Q426,$Q$426:$XFD$426),\"\")","v":""}]
[null,null,"Classement J34",{"$nulls":12},{"$f":"COUNTIF(Q336:Q345,\">0\")","v":0},{"$f":"IF(AND($M$427<>\"\",Q427>0),RANK(Q427,$Q$427:$XFD$427),\"\")","v":""}]
[null,null,"Classement J35",{"$nulls":12},{"$f":"COUNTIF(Q346:Q355,\">0\")","v":0},{"$f":"IF(AND($M$428<>\"\",Q428>0),RANK(Q428,$Q$428:$XFD$428),\"\")","v":""}]
[null,null,"Classement J36",{"$nulls":12},{"$f":"COUNTIF(Q356:Q365,\">0\")","v":0},{"$f":"IF(AND($M$429<>\"\",Q429>0),RANK(Q429,$Q$429:$XFD$429),\"\")","v":""}]
[null,null,"Classement J37",{"$nulls":12},{"$f":"COUNTIF(Q366:Q375,\">0\")","v":0},{"$f":"IF(AND($M$430<>\"\",Q430>0),RANK(Q430,$Q$430:$XFD$430),\"\")","v":""}]
[null,null,"Classement J38",{"$nulls":12},{"$f":"COUNTIF(Q376:Q385,\">0\")","v":0},{"$f":"IF(AND($M$431<>\"\",Q431>0),RANK(Q431,$Q$431:$XFD$431),\"\")","v":""}]
[null,null,"Bonus Classement",{"$nulls":13},{"$f":"COUNTIF(Q440:Q477,1)*Reglement!$S$41+COUNTIF(Q440:Q477,2)*Reglement!$S$42+COUNTIF(Q440:Q477,3)*Reglement!$S$43+COUNTIF(Q440:Q477,4)*Reglement!$S$44+COUNTIF(Q440:Q477,5)*Reglement!$S$45+COUNTIF(Q440:Q477,6)*Reglement!$T$41+COUNTIF(Q440:Q477,7)*Reglement!$T$42+COUNTIF(Q440:Q477,8)*Reglement!$T$43+COUNTIF(Q440:Q477,9)*Reglement!$T$44+COUNTIF(Q440:Q477,10)*Reglement!$T$45","v":0}]
[null,null,"Display Bonus",{"$nulls":13},{"$f":"Q478&\" + \"&Q439","v":"0 + 0"}]
{"$rows_empty":60}
[null,{"$f":"CONCATENATE(\"J540:J\",539+ClassementEQ!B2)","v":"J540:J539"},{"$nulls":5},{"$f":"RANK(J540,INDIRECT($B$540))","v":{"$error":"#DIV/0!"}},"Angers",{"$f":"(SUMIF($Q$392:$XFD$392,$I540,$Q$390:$XFD$390)/COUNTIF($Q$392:$XFD$392,I540)*100)-L540","v":{"$error":"#DIV/0!"}},{"$f":"(SUMIF($Q$392:$XFD$392,$I540,$Q$390:$XFD$390))/COUNTIF($Q$392:$XFD$392,I540)","v":{"$error":"#DIV/0!"}},{"$f":"L539+1","v":1}]
[{"$nulls":7},{"$f":"RANK(J541,INDIRECT($B$540))","v":{"$error":"#DIV/0!"}},"Bordeaux",{"$error":"#DIV/0!"},{"$error":"#DIV/0!"},{"$f":"L540+1","v":2}]
[{"$nulls":7},{"$error":"#DIV/0!"},"Dijon",{"$error":"#DIV/0!"},{"$error":"#DIV/0!"},3]
[{"$nulls":7},{"$error":"#DIV/0!"},"Lille",{"$error":"#DIV/0!"},{"$error":"#DIV/0!"},4]
[{"$nulls":7},{"$error":"#DIV/0!"},"Lyon",{"$error":"#DIV/0!"},{"$error":"#DIV/0!"},5]
[{"$nulls":7},{"$error":"#DIV/0!"},"Marseille",{"$error":"#DIV/0!"},{"$error":"#DIV/0!"},6]
[{"$nulls":7},{"$error":"#DIV/0!"},"Monaco",{"$error":"#DIV/0!"},{"$error":"#DIV/0!"},7]
[{"$nulls":7},{"$error":"#DIV/0!"},"Montpellier",{"$error":"#DIV/0!"},{"$error":"#DIV/0!"},8]
[{"$nulls":7},{"$error":"#DIV/0!"},"Nantes",{"$error":"#DIV/0!"},{"$error":"#DIV/0!"},9]
[{"$nulls":7},{"$error":"#DIV/0!"},"Paris SG",{"$error":"#DIV/0!"},{"$error":"#DIV/0!"},10]
[{"$nulls":7},{"$error":"#DIV/0!"},"Saint-Etienne",{"$error":"#DIV/0!"},{"$error":"#DIV/0!"},11]

{"sheet":"Classement","index":4,"n_rows":8,"n_cols":65,"rows_kept":8,"merged":[[2,16,3,25],[2,26,3,30],[2,31,3,40],[2,41,3,45],[4,5,4,6],[4,56,4,57]]}
[null,{"$f":"MOD(B2,2)","v":1},{"$nulls":4},{"$f":"CONCATENATE(\"$G$7:$G$\",6+$B$2)","v":"$G$7:$G$7"},{"$f":"CONCATENATE(\"$H$7:$H$\",6+$B$2)","v":"$H$7:$H$7"},{"$f":"CONCATENATE(\"$I$7:$I$\",6+$B$2)","v":"$I$7:$I$7"},{"$f":"CONCATENATE(\"$J$7:$J$\",6+$B$2)","v":"$J$7:$J$7"},{"$f":"CONCATENATE(\"$K$7:$K$\",6+$B$2)","v":"$K$7:$K$7"},{"$f":"CONCATENATE(\"$L$7:$L$\",6+$B$2)","v":"$L$7:$L$7"},{"$f":"CONCATENATE(\"$M$7:$M$\",6+$B$2)","v":"$M$7:$M$7"},{"$f":"CONCATENATE(\"$N$7:$N$\",6+$B$2)","v":"$N$7:$N$7"},{"$f":"CONCATENATE(\"$O$7:$O$\",6+$B$2)","v":"$O$7:$O$7"},{"$f":"CONCATENATE(\"$P$7:$P$\",6+$B$2)","v":"$P$7:$P$7"},{"$f":"CONCATENATE(\"$Q$7:$Q$\",6+$B$2)","v":"$Q$7:$Q$7"},{"$f":"CONCATENATE(\"$R$7:$R$\",6+$B$2)","v":"$R$7:$R$7"},{"$f":"CONCATENATE(\"$S$7:$S$\",6+$B$2)","v":"$S$7:$S$7"},{"$f":"CONCATENATE(\"$T$7:$T$\",6+$B$2)","v":"$T$7:$T$7"},{"$f":"CONCATENATE(\"$U$7:$U$\",6+$B$2)","v":"$U$7:$U$7"},{"$f":"CONCATENATE(\"$V$7:$V$\",6+$B$2)","v":"$V$7:$V$7"},{"$f":"CONCATENATE(\"$W$7:$W$\",6+$B$2)","v":"$W$7:$W$7"},{"$f":"CONCATENATE(\"$X$7:$X$\",6+$B$2)","v":"$X$7:$X$7"},{"$f":"CONCATENATE(\"$Y$7:$Y$\",6+$B$2)","v":"$Y$7:$Y$7"},{"$f":"CONCATENATE(\"$Z$7:$Z$\",6+$B$2)","v":"$Z$7:$Z$7"},{"$f":"CONCATENATE(\"$AA$7:$AA$\",6+$B$2)","v":"$AA$7:$AA$7"},{"$f":"CONCATENATE(\"$AB$7:$AB$\",6+$B$2)","v":"$AB$7:$AB$7"},{"$f":"CONCATENATE(\"$AC$7:$AC$\",6+$B$2)","v":"$AC$7:$AC$7"},{"$f":"CONCATENATE(\"$AD$7:$AD$\",6+$B$2)","v":"$AD$7:$AD$7"},{"$f":"CONCATENATE(\"$AE$7:$AE$\",6+$B$2)","v":"$AE$7:$AE$7"},{"$f":"CONCATENATE(\"$AF$7:$AF$\",6+$B$2)","v":"$AF$7:$AF$7"},{"$f":"CONCATENATE(\"$AG$7:$AG$\",6+$B$2)","v":"$AG$7:$AG$7"},{"$f":"CONCATENATE(\"$AH$7:$AH$\",6+$B$2)","v":"$AH$7:$AH$7"},{"$f":"CONCATENATE(\"$AI$7:$AI$\",6+$B$2)","v":"$AI$7:$AI$7"},{"$f":"CONCATENATE(\"$AJ$7:$AJ$\",6+$B$2)","v":"$AJ$7:$AJ$7"},{"$f":"CONCATENATE(\"$AK$7:$AK$\",6+$B$2)","v":"$AK$7:$AK$7"},{"$f":"CONCATENATE(\"$AL$7:$AL$\",6+$B$2)","v":"$AL$7:$AL$7"},{"$f":"CONCATENATE(\"$AM$7:$AM$\",6+$B$2)","v":"$AM$7:$AM$7"},{"$f":"CONCATENATE(\"$AN$7:$AN$\",6+$B$2)","v":"$AN$7:$AN$7"},{"$f":"CONCATENATE(\"$AO$7:$AO$\",6+$B$2)","v":"$AO$7:$AO$7"},{"$f":"CONCATENATE(\"$AP$7:$AP$\",6+$B$2)","v":"$AP$7:$AP$7"},{"$f":"CONCATENATE(\"$AQ$7:$AQ$\",6+$B$2)","v":"$AQ$7:$AQ$7"},{"$f":"CONCATENATE(\"$AR$7:$AR$\",6+$B$2)","v":"$AR$7:$AR$7"},{"$f":"CONCATENATE(\"$AS$7:$AS$\",6+$B$2)","v":"$AS$7:$AS$7"},{"$f":"CONCATENATE(\"$AT$7:$AT$\",6+$B$2)","v":"$AT$7:$AT$7"},{"$f":"CONCATENATE(\"$AU$7:$AU$\",6+$B$2)","v":"$AU$7:$AU$7"},{"$f":"CONCATENATE(\"$AV$7:$AV$\",6+$B$2)","v":"$AV$7:$AV$7"},{"$f":"CONCATENATE(\"$AW$7:$AW$\",6+$B$2)","v":"$AW$7:$AW$7"},{"$f":"CONCATENATE(\"$AX$7:$AX$\",6+$B$2)","v":"$AX$7:$AX$7"},{"$f":"CONCATENATE(\"$AY$7:$AY$\",6+$B$2)","v":"$AY$7:$AY$7"},{"$f":"CONCATENATE(\"$AZ$7:$AZ$\",6+$B$2)","v":"$AZ$7:$AZ$7"},{"$f":"CONCATENATE(\"$BA$7:$BA$\",6+$B$2)","v":"$BA$7:$BA$7"},{"$f":"CONCATENATE(\"$BB$7:$BB$\",6+$B$2)","v":"$BB$7:$BB$7"},{"$nulls":5},{"$f":"CONCATENATE(\"$BH$7:$BH$\",6+$B$2)","v":"$BH$7:$BH$7"},{"$nulls":4},{"$f":"CONCATENATE(\"$BM$7:$BM$\",6+$B$2)","v":"$BM$7:$BM$7"}]
[null,{"$f":"MAX(Points!O387:XFD387)","v":1}]
[null,{"$f":"Points!K2","v":0}]
[null,{"$f":"CONCATENATE(\"$C$7:$X$\",6+B2)","v":"$C$7:$X$7"}]
[null,{"$f":"SUBTOTAL(3,D:D)-1","v":2},"RANG","NOM","EQUIPE","EVOL.",null,"POINTS","FIABILITE","DETAIL","TOUT-PILE","MAX PTS / \nMATCH","MAX PTS / \nJOURNEE","Nb Journées\nGagnées","BONUS","R.O.I","J1","J2","J3","J4","J5","J6","J7","J8","J9","J10","J11","J12","J13","J14","J15","J16","J17","J18","J19","J20","J21","J22","J23","J24","J25","J26","J27","J28","J29","J30","J31","J32","J33","J34","J35","J36","J37","J38","Colonne",null,"Ancien Classement",null,"Actuel","Evol",{"$f":"AVERAGE(INDIRECT(CONCATENATE(\"BI7:BI\",6+B2)))","v":1}]
[{"$nulls":7},-1]
[null,{"$f":"IF(B6<$B$2,B6+1,\"\")","v":1},{"$f":"IF(B7=\"\",\"\",IF(H7=H6,IF($B$1+$B$2=$B$5,\"-\",MAX($C$6:C6)),B7))","v":1},{"$f":"IF(B7=\"\",\"\",INDEX(Points!$Q$388:$XFD$391,4,Classement!BC7-16))","v":0},{"$f":"IF(B7=\"\",\"\",INDEX(Points!$Q$388:$XFD$392,5,Classement!BC7-16))","v":""},{"$f":"IF(B7=\"\",\"\",IF(G7=0,\"ð\",IF(G7<0,\"ø\",\"ö\")))","v":"ð"},{"$f":"IF(B7=\"\",\"\",VLOOKUP(BC7,INDIRECT(CONCATENATE(\"$BF$7:$BH$\",7+$B$2)),3,FALSE))","v":0},{"$f":"IF(B7=\"\",\"\",SUMIF(Points!$Q$389:$XFD$389,B7,Points!$Q$390:$Q$390))","v":0},{"$f":"IF(B7=\"\",\"\",SUMIF(Points!$Q$389:$XFD$389,B7,Points!$Q$393:$Q$393))","v":{"v":1,"d":"100%"}},{"$f":"IF(B7=\"\",\"\",CONCATENATE(SUMIF(Points!$Q$389:$XFD$389,B7,Points!$O$438:$O$438),\" / \",SUMIF(Points!$Q$389:$XFD$389,B7,Points!$P$438:$P$438)))","v":"0 / 0"},{"$f":"IF(B7=\"\",\"\",SUMIF(Points!$Q$389:$XFD$389,B7,Points!$Q$437:$Q$437))","v":0},{"$f":"IF(C7=\"\",\"\",SUMIF(Points!$Q$389:$XFD$389,B7,Points!$Q$435:$Q$435))","v":0},{"$f":"IF(C7=\"\",\"\",SUMIF(Points!$Q$389:$XFD$389,B7,Points!$Q$436:$Q$436))","v":0},{"$f":"IF(C7=\"\",\"\",SUMIF(Points!$Q$389:$XFD$389,B7,Points!$Q$434:$Q$434))","v":0},{"$f":"IF(B7=\"\",\"\",CONCATENATE(SUMIF(Points!$Q$389:$XFD$389,B7,Points!$Q$478:$Q$478),\" + \",SUMIF(Points!$Q$389:$XFD$389,B7,Points!$Q$439:$Q$439)))","v":"0 + 0"},{"$f":"IF(C7=\"\",\"\",SUMIF(Points!$Q$389:$XFD$389,B7,Points!$Q$432:$Q$432))","v":0},{"$f":"IF(B7=\"\",\"\",SUMIF(Points!$Q$389:$XFD$389,B7,Points!$Q$394))","v":0},{"$f":"IF(B7=\"\",\"\",SUMIF(Points!$Q$389:$XFD$389,B7,Points!$Q$395))","v":0},{"$f":"IF(B7=\"\",\"\",SUMIF(Points!$Q$389:$XFD$389,B7,Points!$Q$396))","v":0},{"$f":"IF(B7=\"\",\"\",SUMIF(Points!$Q$389:$XFD$389,B7,Points!$Q$397))","v":0},{"$f":"IF(B7=\"\",\"\",SUMIF(Points!$Q$389:$XFD$389,B7,Points!$Q$398))","v":0},{"$f":"IF(B7=\"\",\"\",SUMIF(Points!$Q$389:$XFD$389,B7,Points!$Q$399))","v":0},{"$f":"IF(B7=\"\",\"\",SUMIF(Points!$Q$389:$XFD$389,B7,Points!$Q$400))","v":0},{"$f":"IF(B7=\"\",\"\",SUMIF(Points!$Q$389:$XFD$389,B7,Points!$Q$401))","v":0},{"$f":"IF(B7=\"\",\"\",SUMIF(Points!$Q$389:$XFD$389,B7,Points!$Q$402))","v":0},{"$f":"IF(B7=\"\",\"\",SUMIF(Points!$Q$389:$XFD$389,B7,Points!$Q$403))","v":0},{"$f":"IF(B7=\"\",\"\",SUMIF(Points!$Q$389:$XFD$389,B7,Points!$Q$404))","v":0},{"$f":"IF(B7=\"\",\"\",SUMIF(Points!$Q$389:$XFD$389,B7,Points!$Q$405))","v":0},{"$f":"IF(B7=\"\",\"\",SUMIF(Points!$Q$389:$XFD$389,B7,Points!$Q$406))","v":0},{"$f":"IF(B7=\"\",\"\",SUMIF(Points!$Q$389:$XFD$389,B7,Points!$Q$407))","v":0},{"$f":"IF(B7=\"\",\"\",SUMIF(Points!$Q$389:$XFD$389,B7,Points!$Q$408))","v":0},{"$f":"IF(B7=\"\",\"\",SUMIF(Points!$Q$389:$XFD$389,B7,Points!$Q$409))","v":0},{"$f":"IF(B7=\"\",\"\",SUMIF(Points!$Q$389:$XFD$389,B7,Points!$Q$410))","v":0},{"$f":"IF(B7=\"\",\"\",SUMIF(Points!$Q$389:$XFD$389,B7,Points!$Q$411))","v":0},{"$f":"IF(B7=\"\",\"\",SUMIF(Points!$Q$389:$XFD$389,B7,Points!$Q$412))","v":0},{"$f":"IF(B7=\"\",\"\",SUMIF(Points!$Q$389:$XFD$389,B7,Points!$Q$413))","v":0},{"$f":"IF(B7=\"\",\"\",SUMIF(Points!$Q$389:$XFD$389,B7,Points!$Q$414))","v":0},{"$f":"IF(B7=\"\",\"\",SUMIF(Points!$Q$389:$XFD$389,B7,Points!$Q$415))","v":0},{"$f":"IF(B7=\"\",\"\",SUMIF(Points!$Q$389:$XFD$389,B7,Points!$Q$416))","v":0},{"$f":"IF(B7=\"\",\"\",SUMIF(Points!$Q$389:$XFD$389,B7,Points!$Q$417))","v":0},{"$f":"IF(B7=\"\",\"\",SUMIF(Points!$Q$389:$XFD$389,B7,Points!$Q$418))","v":0},{"$f":"IF(B7=\"\",\"\",SUMIF(Points!$Q$389:$XFD$389,B7,Points!$Q$419))","v":0},{"$f":"IF(B7=\"\",\"\",SUMIF(Points!$Q$389:$XFD$389,B7,Points!$Q$420))","v":0},{"$f":"IF(B7=\"\",\"\",SUMIF(Points!$Q$389:$XFD$389,B7,Points!$Q$421))","v":0},{"$f":"IF(B7=\"\",\"\",SUMIF(Points!$Q$389:$XFD$389,B7,Points!$Q$422))","v":0},{"$f":"IF(B7=\"\",\"\",SUMIF(Points!$Q$389:$XFD$389,B7,Points!$Q$423))","v":0},{"$f":"IF(B7=\"\",\"\",SUMIF(Points!$Q$389:$XFD$389,B7,Points!$Q$424))","v":0},{"$f":"IF(B7=\"\",\"\",SUMIF(Points!$Q$389:$XFD$389,B7,Points!$Q$425))","v":0},{"$f":"IF(B7=\"\",\"\",SUMIF(Points!$Q$389:$XFD$389,B7,Points!$Q$426))","v":0},{"$f":"IF(B7=\"\",\"\",SUMIF(Points!$Q$389:$XFD$389,B7,Points!$Q$427))","v":0},{"$f":"IF(B7=\"\",\"\",SUMIF(Points!$Q$389:$XFD$389,B7,Points!$Q$428))","v":0},{"$f":"IF(B7=\"\",\"\",SUMIF(Points!$Q$389:$XFD$389,B7,Points!$Q$429))","v":0},{"$f":"IF(B7=\"\",\"\",SUMIF(Points!$Q$389:$XFD$389,B7,Points!$Q$430))","v":0},{"$f":"IF(B7=\"\",\"\",SUMIF(Points!$Q$389:$XFD$389,B7,Points!$Q$431))","v":0},{"$f":"IF(B7=\"\",\"\",SUMIF(Points!$Q$389:$XFD$389,B7,Points!$Q$433:$Q$433))","v":17},{"$f":"IF(B7=\"\",\"\",IF(H7=H6,MAX($C$7:C7),B7))","v":1},1,17,{"$f":"IF(B7=\"\",\"\",VLOOKUP(BF7,INDIRECT(CONCATENATE(\"$BC$7:$BD$\",7+$B$2)),2,FALSE))","v":1},{"$f":"BE7-BG7","v":0},{"$f":"IF(BH7<>\"\",RANK(BH7,INDIRECT($BH$1)),\"\")","v":1},{"$f":"IF(BI7<(Reglement!$S$13+1),INDEX(Points!$Q$388:$XFD$391,4,Classement!BF7-16),\"\")","v":0},{"$f":"IF(BH7<>\"\",RANK(BH7,INDIRECT($BH$1),1),\"\")","v":1},{"$f":"IF(BK7<(Reglement!$S$13+1),INDEX(Points!$Q$388:$XFD$391,4,Classement!BF7-16),\"\")","v":0},{"$f":"H7-SUM(Q7:BB7)","v":0}]
[null,"",{"$f":"IF(B8=\"\",\"\",IF(H8=H7,IF($B$1+$B$2=$B$5,\"-\",MAX($C$6:C7)),B8))","v":""},{"$f":"IF(B8=\"\",\"\",INDEX(Points!$Q$388:$XFD$391,4,Classement!BC8-16))","v":""},{"$f":"IF(B8=\"\",\"\",INDEX(Points!$Q$388:$XFD$392,5,Classement!BC8-16))","v":""},{"$f":"IF(B8=\"\",\"\",IF(G8=0,\"ð\",IF(G8<0,\"ø\",\"ö\")))","v":""},{"$f":"IF(B8=\"\",\"\",VLOOKUP(BC8,INDIRECT(CONCATENATE(\"$BF$7:$BH$\",7+$B$2)),3,FALSE))","v":""},{"$f":"IF(B8=\"\",\"\",SUMIF(Points!$Q$389:$XFD$389,B8,Points!$Q$390:$Q$390))","v":""},{"$f":"IF(B8=\"\",\"\",SUMIF(Points!$Q$389:$XFD$389,B8,Points!$Q$393:$Q$393))","v":""},{"$f":"IF(B8=\"\",\"\",CONCATENATE(SUMIF(Points!$Q$389:$XFD$389,B8,Points!$O$438:$O$438),\" / \",SUMIF(Points!$Q$389:$XFD$389,B8,Points!$P$438:$P$438)))","v":""},{"$f":"IF(B8=\"\",\"\",SUMIF(Points!$Q$389:$XFD$389,B8,Points!$Q$437:$Q$437))","v":""},{"$f":"IF(C8=\"\",\"\",SUMIF(Points!$Q$389:$XFD$389,B8,Points!$Q$435:$Q$435))","v":""},{"$f":"IF(C8=\"\",\"\",SUMIF(Points!$Q$389:$XFD$389,B8,Points!$Q$436:$Q$436))","v":""},{"$f":"IF(C8=\"\",\"\",SUMIF(Points!$Q$389:$XFD$389,B8,Points!$Q$434:$Q$434))","v":""},{"$f":"IF(B8=\"\",\"\",CONCATENATE(SUMIF(Points!$Q$389:$XFD$389,B8,Points!$Q$478:$Q$478),\" + \",SUMIF(Points!$Q$389:$XFD$389,B8,Points!$Q$439:$Q$439)))","v":""},{"$f":"IF(C8=\"\",\"\",SUMIF(Points!$Q$389:$XFD$389,B8,Points!$Q$432:$Q$432))","v":""},{"$f":"IF(B8=\"\",\"\",SUMIF(Points!$Q$389:$XFD$389,B8,Points!$Q$394))","v":""},{"$f":"IF(B8=\"\",\"\",SUMIF(Points!$Q$389:$XFD$389,B8,Points!$Q$395))","v":""},{"$f":"IF(B8=\"\",\"\",SUMIF(Points!$Q$389:$XFD$389,B8,Points!$Q$396))","v":""},{"$f":"IF(B8=\"\",\"\",SUMIF(Points!$Q$389:$XFD$389,B8,Points!$Q$397))","v":""},{"$f":"IF(B8=\"\",\"\",SUMIF(Points!$Q$389:$XFD$389,B8,Points!$Q$398))","v":""},{"$f":"IF(B8=\"\",\"\",SUMIF(Points!$Q$389:$XFD$389,B8,Points!$Q$399))","v":""},{"$f":"IF(B8=\"\",\"\",SUMIF(Points!$Q$389:$XFD$389,B8,Points!$Q$400))","v":""},{"$f":"IF(B8=\"\",\"\",SUMIF(Points!$Q$389:$XFD$389,B8,Points!$Q$401))","v":""},{"$f":"IF(B8=\"\",\"\",SUMIF(Points!$Q$389:$XFD$389,B8,Points!$Q$402))","v":""},{"$f":"IF(B8=\"\",\"\",SUMIF(Points!$Q$389:$XFD$389,B8,Points!$Q$403))","v":""},{"$f":"IF(B8=\"\",\"\",SUMIF(Points!$Q$389:$XFD$389,B8,Points!$Q$404))","v":""},{"$f":"IF(B8=\"\",\"\",SUMIF(Points!$Q$389:$XFD$389,B8,Points!$Q$405))","v":""},{"$f":"IF(B8=\"\",\"\",SUMIF(Points!$Q$389:$XFD$389,B8,Points!$Q$406))","v":""},{"$f":"IF(B8=\"\",\"\",SUMIF(Points!$Q$389:$XFD$389,B8,Points!$Q$407))","v":""},{"$f":"IF(B8=\"\",\"\",SUMIF(Points!$Q$389:$XFD$389,B8,Points!$Q$408))","v":""},{"$f":"IF(B8=\"\",\"\",SUMIF(Points!$Q$389:$XFD$389,B8,Points!$Q$409))","v":""},{"$f":"IF(B8=\"\",\"\",SUMIF(Points!$Q$389:$XFD$389,B8,Points!$Q$410))","v":""},{"$f":"IF(B8=\"\",\"\",SUMIF(Points!$Q$389:$XFD$389,B8,Points!$Q$411))","v":""},{"$f":"IF(B8=\"\",\"\",SUMIF(Points!$Q$389:$XFD$389,B8,Points!$Q$412))","v":""},{"$f":"IF(B8=\"\",\"\",SUMIF(Points!$Q$389:$XFD$389,B8,Points!$Q$413))","v":""},{"$f":"IF(B8=\"\",\"\",SUMIF(Points!$Q$389:$XFD$389,B8,Points!$Q$414))","v":""},{"$f":"IF(B8=\"\",\"\",SUMIF(Points!$Q$389:$XFD$389,B8,Points!$Q$415))","v":""},{"$f":"IF(B8=\"\",\"\",SUMIF(Points!$Q$389:$XFD$389,B8,Points!$Q$416))","v":""},{"$f":"IF(B8=\"\",\"\",SUMIF(Points!$Q$389:$XFD$389,B8,Points!$Q$417))","v":""},{"$f":"IF(B8=\"\",\"\",SUMIF(Points!$Q$389:$XFD$389,B8,Points!$Q$418))","v":""},{"$f":"IF(B8=\"\",\"\",SUMIF(Points!$Q$389:$XFD$389,B8,Points!$Q$419))","v":""},{"$f":"IF(B8=\"\",\"\",SUMIF(Points!$Q$389:$XFD$389,B8,Points!$Q$420))","v":""},{"$f":"IF(B8=\"\",\"\",SUMIF(Points!$Q$389:$XFD$389,B8,Points!$Q$421))","v":""},{"$f":"IF(B8=\"\",\"\",SUMIF(Points!$Q$389:$XFD$389,B8,Points!$Q$422))","v":""},{"$f":"IF(B8=\"\",\"\",SUMIF(Points!$Q$389:$XFD$389,B8,Points!$Q$423))","v":""},{"$f":"IF(B8=\"\",\"\",SUMIF(Points!$Q$389:$XFD$389,B8,Points!$Q$424))","v":""},{"$f":"IF(B8=\"\",\"\",SUMIF(Points!$Q$389:$XFD$389,B8,Points!$Q$425))","v":""},{"$f":"IF(B8=\"\",\"\",SUMIF(Points!$Q$389:$XFD$389,B8,Points!$Q$426))","v":""},{"$f":"IF(B8=\"\",\"\",SUMIF(Points!$Q$389:$XFD$389,B8,Points!$Q$427))","v":""},{"$f":"IF(B8=\"\",\"\",SUMIF(Points!$Q$389:$XFD$389,B8,Points!$Q$428))","v":""},{"$f":"IF(B8=\"\",\"\",SUMIF(Points!$Q$389:$XFD$389,B8,Points!$Q$429))","v":""},{"$f":"IF(B8=\"\",\"\",SUMIF(Points!$Q$389:$XFD$389,B8,Points!$Q$430))","v":""},{"$f":"IF(B8=\"\",\"\",SUMIF(Points!$Q$389:$XFD$389,B8,Points!$Q$431))","v":""},{"$f":"IF(B8=\"\",\"\",SUMIF(Points!$Q$389:$XFD$389,B8,Points!$Q$433:$Q$433))","v":""},{"$f":"IF(B8=\"\",\"\",IF(H8=H7,MAX($C$7:C8),B8))","v":""},"","",{"$f":"IF(B8=\"\",\"\",VLOOKUP(BF8,INDIRECT(CONCATENATE(\"$BC$7:$BD$\",7+$B$2)),2,FALSE))","v":""},{"$f":"BE8-BG8","v":{"$error":"#VALUE!"}},{"$f":"IF(BH8<>\"\",RANK(BH8,INDIRECT($BH$1)),\"\")","v":{"$error":"#VALUE!"}},{"$f":"IF(BI8<(Reglement!$S$13+1),INDEX(Points!$Q$388:$XFD$391,4,Classement!BF8-16),\"\")","v":{"$error":"#VALUE!"}},{"$f":"IF(BH8<>\"\",RANK(BH8,INDIRECT($BH$1),1),\"\")","v":{"$error":"#VALUE!"}},{"$f":"IF(BK8<(Reglement!$S$13+1),INDEX(Points!$Q$388:$XFD$391,4,Classement!BF8-16),\"\")","v":{"$error":"#VALUE!"}},{"$f":"H8-SUM(Q8:BB8)","v":{"$error":"#VALUE!"}}]

{"sheet":"ClassementEQ","index":5,"n_rows":8,"n_cols":60,"rows_kept":8,"merged":[[2,16,3,25],[2,26,3,30],[2,31,3,40],[2,41,3,45],[4,5,4,6],[4,56,4,57]]}
[null,{"$f":"Classement!B2","v":1},null,{"$f":"CONCATENATE(\"Points!$H$540:$K$\",539+B2)","v":"Points!$H$540:$K$539"},{"$f":"CONCATENATE(\"Points!$H$540:$I$\",539+B2)","v":"Points!$H$540:$I$539"},null,{"$f":"CONCATENATE(\"$G$7:$G$\",6+$B$2)","v":"$G$7:$G$6"},{"$f":"CONCATENATE(\"$H$7:$H$\",6+$B$2)","v":"$H$7:$H$6"},{"$f":"CONCATENATE(\"$I$7:$I$\",6+$B$2)","v":"$I$7:$I$6"},{"$f":"CONCATENATE(\"$J$7:$J$\",6+$B$2)","v":"$J$7:$J$6"},{"$f":"CONCATENATE(\"$K$7:$K$\",6+$B$2)","v":"$K$7:$K$6"},{"$f":"CONCATENATE(\"$L$7:$L$\",6+$B$2)","v":"$L$7:$L$6"},{"$f":"CONCATENATE(\"$M$7:$M$\",6+$B$2)","v":"$M$7:$M$6"},{"$f":"CONCATENATE(\"$N$7:$N$\",6+$B$2)","v":"$N$7:$N$6"},{"$f":"CONCATENATE(\"$O$7:$O$\",6+$B$2)","v":"$O$7:$O$6"},{"$f":"CONCATENATE(\"$P$7:$P$\",6+$B$2)","v":"$P$7:$P$6"},{"$f":"CONCATENATE(\"$Q$7:$Q$\",6+$B$2)","v":"$Q$7:$Q$6"},{"$f":"CONCATENATE(\"$R$7:$R$\",6+$B$2)","v":"$R$7:$R$6"},{"$f":"CONCATENATE(\"$S$7:$S$\",6+$B$2)","v":"$S$7:$S$6"},{"$f":"CONCATENATE(\"$T$7:$T$\",6+$B$2)","v":"$T$7:$T$6"},{"$f":"CONCATENATE(\"$U$7:$U$\",6+$B$2)","v":"$U$7:$U$6"},{"$f":"CONCATENATE(\"$V$7:$V$\",6+$B$2)","v":"$V$7:$V$6"},{"$f":"CONCATENATE(\"$W$7:$W$\",6+$B$2)","v":"$W$7:$W$6"},{"$f":"CONCATENATE(\"$X$7:$X$\",6+$B$2)","v":"$X$7:$X$6"},{"$f":"CONCATENATE(\"$Y$7:$Y$\",6+$B$2)","v":"$Y$7:$Y$6"},{"$f":"CONCATENATE(\"$Z$7:$Z$\",6+$B$2)","v":"$Z$7:$Z$6"},{"$f":"CONCATENATE(\"$AA$7:$AA$\",6+$B$2)","v":"$AA$7:$AA$6"},{"$f":"CONCATENATE(\"$AB$7:$AB$\",6+$B$2)","v":"$AB$7:$AB$6"},{"$f":"CONCATENATE(\"$AC$7:$AC$\",6+$B$2)","v":"$AC$7:$AC$6"},{"$f":"CONCATENATE(\"$AD$7:$AD$\",6+$B$2)","v":"$AD$7:$AD$6"},{"$f":"CONCATENATE(\"$AE$7:$AE$\",6+$B$2)","v":"$AE$7:$AE$6"},{"$f":"CONCATENATE(\"$AF$7:$AF$\",6+$B$2)","v":"$AF$7:$AF$6"},{"$f":"CONCATENATE(\"$AG$7:$AG$\",6+$B$2)","v":"$AG$7:$AG$6"},{"$f":"CONCATENATE(\"$AH$7:$AH$\",6+$B$2)","v":"$AH$7:$AH$6"},{"$f":"CONCATENATE(\"$AI$7:$AI$\",6+$B$2)","v":"$AI$7:$AI$6"},{"$f":"CONCATENATE(\"$AJ$7:$AJ$\",6+$B$2)","v":"$AJ$7:$AJ$6"},{"$f":"CONCATENATE(\"$AK$7:$AK$\",6+$B$2)","v":"$AK$7:$AK$6"},{"$f":"CONCATENATE(\"$AL$7:$AL$\",6+$B$2)","v":"$AL$7:$AL$6"},{"$f":"CONCATENATE(\"$AM$7:$AM$\",6+$B$2)","v":"$AM$7:$AM$6"},{"$f":"CONCATENATE(\"$AN$7:$AN$\",6+$B$2)","v":"$AN$7:$AN$6"},{"$f":"CONCATENATE(\"$AO$7:$AO$\",6+$B$2)","v":"$AO$7:$AO$6"},{"$f":"CONCATENATE(\"$AP$7:$AP$\",6+$B$2)","v":"$AP$7:$AP$6"},{"$f":"CONCATENATE(\"$AQ$7:$AQ$\",6+$B$2)","v":"$AQ$7:$AQ$6"},{"$f":"CONCATENATE(\"$AR$7:$AR$\",6+$B$2)","v":"$AR$7:$AR$6"},{"$f":"CONCATENATE(\"$AS$7:$AS$\",6+$B$2)","v":"$AS$7:$AS$6"},{"$f":"CONCATENATE(\"$AT$7:$AT$\",6+$B$2)","v":"$AT$7:$AT$6"},{"$f":"CONCATENATE(\"$AU$7:$AU$\",6+$B$2)","v":"$AU$7:$AU$6"},{"$f":"CONCATENATE(\"$AV$7:$AV$\",6+$B$2)","v":"$AV$7:$AV$6"},{"$f":"CONCATENATE(\"$AW$7:$AW$\",6+$B$2)","v":"$AW$7:$AW$6"},{"$f":"CONCATENATE(\"$AX$7:$AX$\",6+$B$2)","v":"$AX$7:$AX$6"},{"$f":"CONCATENATE(\"$AY$7:$AY$\",6+$B$2)","v":"$AY$7:$AY$6"},{"$f":"CONCATENATE(\"$AZ$7:$AZ$\",6+$B$2)","v":"$AZ$7:$AZ$6"},{"$f":"CONCATENATE(\"$BA$7:$BA$\",6+$B$2)","v":"$BA$7:$BA$6"},{"$f":"CONCATENATE(\"$BB$7:$BB$\",6+$B$2)","v":"$BB$7:$BB$6"},{"$nulls":5},{"$f":"CONCATENATE(\"$BH$7:$BH$\",6+$B$2)","v":"$BH$7:$BH$6"}]
[null,{"$f":"Points!M392","v":0}]
[null,{"$f":"Points!K5","v":{"$error":"#N/A"}}]
[null,{"$f":"CONCATENATE(\"$C$7:$X$\",6+B2)","v":"$C$7:$X$6"}]
[null,null,"RANG","EQUIPE","Nbr Joueurs","EVOL",null,"MOY. POINTS","FIABILITE","DETAIL","MOY. TOUT-PILE","POINTS MAX","POINTS MIN","MEILLEUR CLASS.","PIRE CLASS.","MOY.  R.O.I","J1","J2","J3","J4","J5","J6","J7","J8","J9","J10","J11","J12","J13","J14","J15","J16","J17","J18","J19","J20","J21","J22","J23","J24","J25","J26","J27","J28","J29","J30","J31","J32","J33","J34","J35","J36","J37","J38","Colonne",null,"Ancien Classement",null,"Actuel","Evol"]
[{"$nulls":7},-1]
[null,{"$f":"IF(B6<$B$2,B6+1,\"\")","v":""},{"$f":"IF(B7=\"\",\"\",IF(H7=H6,\"-\",B7))","v":""},{"$f":"IF(B7=\"\",\"\",VLOOKUP(B7,INDIRECT($E$1),2,FALSE))","v":""},{"$f":"IF(B7=\"\",\"\",COUNTIF(Points!$392:$392,D7))","v":""},{"$f":"IF(B7=\"\",\"\",IF(G7=0,\"ð\",IF(G7<0,\"ø\",\"ö\")))","v":""},{"$f":"IF(B7=\"\",\"\",VLOOKUP(BC7,INDIRECT(CONCATENATE(\"$BF$7:$BH$\",7+$B$2)),3,FALSE))","v":""},{"$f":"IF(B7=\"\",\"\",VLOOKUP(B7,INDIRECT($D$1),4,FALSE))","v":""},{"$f":"IF(B7=\"\",\"\",IF(SUMIF(Points!$Q$392:$XFD$392,D7,Points!$P$438:$P$438)>0,SUMIF(Points!$Q$392:$XFD$392,D7,Points!$O$438:$O$438)/SUMIF(Points!$Q$392:$XFD$392,D7,Points!$P$438:$P$438),1))","v":""},{"$f":"IF(B7=\"\",\"\",CONCATENATE(SUMIF(Points!$Q$392:$XFD$392,D7,Points!$O$438:$O$438),\" / \",SUMIF(Points!$Q$392:$XFD$392,D7,Points!$P$438:$P$438)))","v":""},{"$f":"IF(B7=\"\",\"\",AVERAGEIF(INDIRECT(CONCATENATE(\"Classement!$E$7:$E$\",6+$B$1)),D7,INDIRECT(CONCATENATE(\"Classement!$K$7:$K$\",6+$B$1))))","v":""},{"$f":"IF(B7=\"\",\"\",MAX(IF(Points!$Q$392:$XFD$392=ClassementEQ!D7,Points!$Q$390:$XFD$390)))","v":""},{"$f":"IF(B7=\"\",\"\",MIN(IF(Points!$Q$392:$XFD$392=ClassementEQ!D7,Points!$Q$390:$XFD$390)))","v":""},{"$f":"IF(B7=\"\",\"\",MIN(IF(Points!$Q$392:$XFD$392=ClassementEQ!D7,Points!$Q$386:$XFD$386)))","v":""},{"$f":"IF(B7=\"\",\"\",MAX(IF(Points!$Q$392:$XFD$392=ClassementEQ!D7,Points!$Q$386:$XFD$386)))","v":""},{"$f":"IF(B7=\"\",\"\",AVERAGEIF(Points!$Q$392:$XFD$392,D7,Points!$Q$432:$Q$432))","v":""},{"$f":"IF(B7=\"\",\"\",AVERAGEIF(Points!$Q$392:$XFD$392,D7,Points!$Q$394:$Q$394))","v":""},{"$f":"IF(B7=\"\",\"\",AVERAGEIF(Points!$Q$392:$XFD$392,D7,Points!$Q$395:$Q$395))","v":""},{"$f":"IF(B7=\"\",\"\",AVERAGEIF(Points!$Q$392:$XFD$392,D7,Points!$Q$396:$Q$396))","v":""},{"$f":"IF(B7=\"\",\"\",AVERAGEIF(Points!$Q$392:$XFD$392,D7,Points!$Q$397:$Q$397))","v":""},{"$f":"IF(B7=\"\",\"\",AVERAGEIF(Points!$Q$392:$XFD$392,D7,Points!$Q$398:$Q$398))","v":""},{"$f":"IF(B7=\"\",\"\",AVERAGEIF(Points!$Q$392:$XFD$392,D7,Points!$Q$399:$Q$399))","v":""},{"$f":"IF(B7=\"\",\"\",AVERAGEIF(Points!$Q$392:$XFD$392,D7,Points!$Q$400:$Q$400))","v":""},{"$f":"IF(B7=\"\",\"\",AVERAGEIF(Points!$Q$392:$XFD$392,D7,Points!$Q$401:$Q$401))","v":""},{"$f":"IF(B7=\"\",\"\",AVERAGEIF(Points!$Q$392:$XFD$392,D7,Points!$Q$402:$Q$402))","v":""},{"$f":"IF(B7=\"\",\"\",AVERAGEIF(Points!$Q$392:$XFD$392,D7,Points!$Q$403:$Q$403))","v":""},{"$f":"IF(B7=\"\",\"\",AVERAGEIF(Points!$Q$392:$XFD$392,D7,Points!$Q$404:$Q$404))","v":""},{"$f":"IF(B7=\"\",\"\",AVERAGEIF(Points!$Q$392:$XFD$392,D7,Points!$Q$405:$Q$405))","v":""},{"$f":"IF(B7=\"\",\"\",AVERAGEIF(Points!$Q$392:$XFD$392,D7,Points!$Q$406:$Q$406))","v":""},{"$f":"IF(B7=\"\",\"\",AVERAGEIF(Points!$Q$392:$XFD$392,D7,Points!$Q$407:$Q$407))","v":""},{"$f":"IF(B7=\"\",\"\",AVERAGEIF(Points!$Q$392:$XFD$392,D7,Points!$Q$408:$Q$408))","v":""},{"$f":"IF(B7=\"\",\"\",AVERAGEIF(Points!$Q$392:$XFD$392,D7,Points!$Q$409:$Q$409))","v":""},{"$f":"IF(B7=\"\",\"\",AVERAGEIF(Points!$Q$392:$XFD$392,D7,Points!$Q$410:$Q$410))","v":""},{"$f":"IF(B7=\"\",\"\",AVERAGEIF(Points!$Q$392:$XFD$392,D7,Points!$Q$411:$Q$411))","v":""},{"$f":"IF(B7=\"\",\"\",AVERAGEIF(Points!$Q$392:$XFD$392,D7,Points!$Q$412:$Q$412))","v":""},{"$f":"IF(B7=\"\",\"\",AVERAGEIF(Points!$Q$392:$XFD$392,D7,Points!$Q$413:$Q$413))","v":""},{"$f":"IF(B7=\"\",\"\",AVERAGEIF(Points!$Q$392:$XFD$392,D7,Points!$Q$414:$Q$414))","v":""},{"$f":"IF(B7=\"\",\"\",AVERAGEIF(Points!$Q$392:$XFD$392,D7,Points!$Q$415:$Q$415))","v":""},{"$f":"IF(B7=\"\",\"\",AVERAGEIF(Points!$Q$392:$XFD$392,D7,Points!$Q$416:$Q$416))","v":""},{"$f":"IF(B7=\"\",\"\",AVERAGEIF(Points!$Q$392:$XFD$392,D7,Points!$Q$417:$Q$417))","v":""},{"$f":"IF(B7=\"\",\"\",AVERAGEIF(Points!$Q$392:$XFD$392,D7,Points!$Q$418:$Q$418))","v":""},{"$f":"IF(B7=\"\",\"\",AVERAGEIF(Points!$Q$392:$XFD$392,D7,Points!$Q$419:$Q$419))","v":""},{"$f":"IF(B7=\"\",\"\",AVERAGEIF(Points!$Q$392:$XFD$392,D7,Points!$Q$420:$Q$420))","v":""},{"$f":"IF(B7=\"\",\"\",AVERAGEIF(Points!$Q$392:$XFD$392,D7,Points!$Q$421:$Q$421))","v":""},{"$f":"IF(B7=\"\",\"\",AVERAGEIF(Points!$Q$392:$XFD$392,D7,Points!$Q$422:$Q$422))","v":""},{"$f":"IF(B7=\"\",\"\",AVERAGEIF(Points!$Q$392:$XFD$392,D7,Points!$Q$423:$Q$423))","v":""},{"$f":"IF(B7=\"\",\"\",AVERAGEIF(Points!$Q$392:$XFD$392,D7,Points!$Q$424:$Q$424))","v":""},{"$f":"IF(B7=\"\",\"\",AVERAGEIF(Points!$Q$392:$XFD$392,D7,Points!$Q$425:$Q$425))","v":""},{"$f":"IF(B7=\"\",\"\",AVERAGEIF(Points!$Q$392:$XFD$392,D7,Points!$Q$426:$Q$426))","v":""},{"$f":"IF(B7=\"\",\"\",AVERAGEIF(Points!$Q$392:$XFD$392,D7,Points!$Q$427:$Q$427))","v":""},{"$f":"IF(B7=\"\",\"\",AVERAGEIF(Points!$Q$392:$XFD$392,D7,Points!$Q$428:$Q$428))","v":""},{"$f":"IF(B7=\"\",\"\",AVERAGEIF(Points!$Q$392:$XFD$392,D7,Points!$Q$429:$Q$429))","v":""},{"$f":"IF(B7=\"\",\"\",AVERAGEIF(Points!$Q$392:$XFD$392,D7,Points!$Q$430:$Q$430))","v":""},{"$f":"IF(B7=\"\",\"\",AVERAGEIF(Points!$Q$392:$XFD$392,D7,Points!$Q$431:$Q$431))","v":""},{"$f":"D7","v":""},{"$f":"IF(B7=\"\",\"\",IF(H7=H6,MAX($C$7:C7),B7))","v":""},"","",{"$f":"IF(B7=\"\",\"\",VLOOKUP(BF7,INDIRECT(CONCATENATE(\"$BC$7:$BD$\",7+$B$2)),2,FALSE))","v":""},{"$f":"BE7-BG7","v":{"$error":"#VALUE!"}}]
[null,"",{"$f":"IF(B8=\"\",\"\",IF(H8=H7,\"-\",B8))","v":""},{"$f":"IF(B8=\"\",\"\",VLOOKUP(B8,INDIRECT($E$1),2,FALSE))","v":""},{"$f":"IF(B8=\"\",\"\",COUNTIF(Points!$392:$392,D8))","v":""},{"$f":"IF(B8=\"\",\"\",IF(G8=0,\"ð\",IF(G8<0,\"ø\",\"ö\")))","v":""},{"$f":"IF(B8=\"\",\"\",VLOOKUP(BC8,INDIRECT(CONCATENATE(\"$BF$7:$BH$\",7+$B$2)),3,FALSE))","v":""},{"$f":"IF(B8=\"\",\"\",VLOOKUP(B8,INDIRECT($D$1),4,FALSE))","v":""},{"$f":"IF(B8=\"\",\"\",IF(SUMIF(Points!$Q$392:$XFD$392,D8,Points!$P$438:$P$438)>0,SUMIF(Points!$Q$392:$XFD$392,D8,Points!$O$438:$O$438)/SUMIF(Points!$Q$392:$XFD$392,D8,Points!$P$438:$P$438),1))","v":""},{"$f":"IF(B8=\"\",\"\",CONCATENATE(SUMIF(Points!$Q$392:$XFD$392,D8,Points!$O$438:$O$438),\" / \",SUMIF(Points!$Q$392:$XFD$392,D8,Points!$P$438:$P$438)))","v":""},{"$f":"IF(B8=\"\",\"\",AVERAGEIF(INDIRECT(CONCATENATE(\"Classement!$E$7:$E$\",6+$B$1)),D8,INDIRECT(CONCATENATE(\"Classement!$K$7:$K$\",6+$B$1))))","v":""},{"$f":"IF(B8=\"\",\"\",MAX(IF(Points!$Q$392:$XFD$392=ClassementEQ!D8,Points!$Q$390:$XFD$390)))","v":""},{"$f":"IF(B8=\"\",\"\",MIN(IF(Points!$Q$392:$XFD$392=ClassementEQ!D8,Points!$Q$390:$XFD$390)))","v":""},{"$f":"IF(B8=\"\",\"\",MIN(IF(Points!$Q$392:$XFD$392=ClassementEQ!D8,Points!$Q$386:$XFD$386)))","v":""},{"$f":"IF(B8=\"\",\"\",MAX(IF(Points!$Q$392:$XFD$392=ClassementEQ!D8,Points!$Q$386:$XFD$386)))","v":""},{"$f":"IF(B8=\"\",\"\",AVERAGEIF(Points!$Q$392:$XFD$392,D8,Points!$Q$432:$Q$432))","v":""},{"$f":"IF(B8=\"\",\"\",AVERAGEIF(Points!$Q$392:$XFD$392,D8,Points!$Q$394:$Q$394))","v":""},{"$f":"IF(B8=\"\",\"\",AVERAGEIF(Points!$Q$392:$XFD$392,D8,Points!$Q$395:$Q$395))","v":""},{"$f":"IF(B8=\"\",\"\",AVERAGEIF(Points!$Q$392:$XFD$392,D8,Points!$Q$396:$Q$396))","v":""},{"$f":"IF(B8=\"\",\"\",AVERAGEIF(Points!$Q$392:$XFD$392,D8,Points!$Q$397:$Q$397))","v":""},{"$f":"IF(B8=\"\",\"\",AVERAGEIF(Points!$Q$392:$XFD$392,D8,Points!$Q$398:$Q$398))","v":""},{"$f":"IF(B8=\"\",\"\",AVERAGEIF(Points!$Q$392:$XFD$392,D8,Points!$Q$399:$Q$399))","v":""},{"$f":"IF(B8=\"\",\"\",AVERAGEIF(Points!$Q$392:$XFD$392,D8,Points!$Q$400:$Q$400))","v":""},{"$f":"IF(B8=\"\",\"\",AVERAGEIF(Points!$Q$392:$XFD$392,D8,Points!$Q$401:$Q$401))","v":""},{"$f":"IF(B8=\"\",\"\",AVERAGEIF(Points!$Q$392:$XFD$392,D8,Points!$Q$402:$Q$402))","v":""},{"$f":"IF(B8=\"\",\"\",AVERAGEIF(Points!$Q$392:$XFD$392,D8,Points!$Q$403:$Q$403))","v":""},{"$f":"IF(B8=\"\",\"\",AVERAGEIF(Points!$Q$392:$XFD$392,D8,Points!$Q$404:$Q$404))","v":""},{"$f":"IF(B8=\"\",\"\",AVERAGEIF(Points!$Q$392:$XFD$392,D8,Points!$Q$405:$Q$405))","v":""},{"$f":"IF(B8=\"\",\"\",AVERAGEIF(Points!$Q$392:$XFD$392,D8,Points!$Q$406:$Q$406))","v":""},{"$f":"IF(B8=\"\",\"\",AVERAGEIF(Points!$Q$392:$XFD$392,D8,Points!$Q$407:$Q$407))","v":""},{"$f":"IF(B8=\"\",\"\",AVERAGEIF(Points!$Q$392:$XFD$392,D8,Points!$Q$408:$Q$408))","v":""},{"$f":"IF(B8=\"\",\"\",AVERAGEIF(Points!$Q$392:$XFD$392,D8,Points!$Q$409:$Q$409))","v":""},{"$f":"IF(B8=\"\",\"\",AVERAGEIF(Points!$Q$392:$XFD$392,D8,Points!$Q$410:$Q$410))","v":""},{"$f":"IF(B8=\"\",\"\",AVERAGEIF(Points!$Q$392:$XFD$392,D8,Points!$Q$411:$Q$411))","v":""},{"$f":"IF(B8=\"\",\"\",AVERAGEIF(Points!$Q$392:$XFD$392,D8,Points!$Q$412:$Q$412))","v":""},{"$f":"IF(B8=\"\",\"\",AVERAGEIF(Points!$Q$392:$XFD$392,D8,Points!$Q$413:$Q$413))","v":""},{"$f":"IF(B8=\"\",\"\",AVERAGEIF(Points!$Q$392:$XFD$392,D8,Points!$Q$414:$Q$414))","v":""},{"$f":"IF(B8=\"\",\"\",AVERAGEIF(Points!$Q$392:$XFD$392,D8,Points!$Q$415:$Q$415))","v":""},{"$f":"IF(B8=\"\",\"\",AVERAGEIF(Points!$Q$392:$XFD$392,D8,Points!$Q$416:$Q$416))","v":""},{"$f":"IF(B8=\"\",\"\",AVERAGEIF(Points!$Q$392:$XFD$392,D8,Points!$Q$417:$Q$417))","v":""},{"$f":"IF(B8=\"\",\"\",AVERAGEIF(Points!$Q$392:$XFD$392,D8,Points!$Q$418:$Q$418))","v":""},{"$f":"IF(B8=\"\",\"\",AVERAGEIF(Points!$Q$392:$XFD$392,D8,Points!$Q$419:$Q$419))","v":""},{"$f":"IF(B8=\"\",\"\",AVERAGEIF(Points!$Q$392:$XFD$392,D8,Points!$Q$420:$Q$420))","v":""},{"$f":"IF(B8=\"\",\"\",AVERAGEIF(Points!$Q$392:$XFD$392,D8,Points!$Q$421:$Q$421))","v":""},{"$f":"IF(B8=\"\",\"\",AVERAGEIF(Points!$Q$392:$XFD$392,D8,Points!$Q$422:$Q$422))","v":""},{"$f":"IF(B8=\"\",\"\",AVERAGEIF(Points!$Q$392:$XFD$392,D8,Points!$Q$423:$Q$423))","v":""},{"$f":"IF(B8=\"\",\"\",AVERAGEIF(Points!$Q$392:$XFD$392,D8,Points!$Q$424:$Q$424))","v":""},{"$f":"IF(B8=\"\",\"\",AVERAGEIF(Points!$Q$392:$XFD$392,D8,Points!$Q$425:$Q$425))","v":""},{"$f":"IF(B8=\"\",\"\",AVERAGEIF(Points!$Q$392:$XFD$392,D8,Points!$Q$426:$Q$426))","v":""},{"$f":"IF(B8=\"\",\"\",AVERAGEIF(Points!$Q$392:$XFD$392,D8,Points!$Q$427:$Q$427))","v":""},{"$f":"IF(B8=\"\",\"\",AVERAGEIF(Points!$Q$392:$XFD$392,D8,Points!$Q$428:$Q$428))","v":""},{"$f":"IF(B8=\"\",\"\",AVERAGEIF(Points!$Q$392:$XFD$392,D8,Points!$Q$429:$Q$429))","v":""},{"$f":"IF(B8=\"\",\"\",AVERAGEIF(Points!$Q$392:$XFD$392,D8,Points!$Q$430:$Q$430))","v":""},{"$f":"IF(B8=\"\",\"\",AVERAGEIF(Points!$Q$392:$XFD$392,D8,Points!$Q$431:$Q$431))","v":""},{"$f":"D8","v":""},{"$f":"IF(B8=\"\",\"\",IF(H8=H7,MAX($C$7:C8),B8))","v":""},1,"Bordeaux",{"$f":"IF(B8=\"\",\"\",VLOOKUP(BF8,INDIRECT(CONCATENATE(\"$BC$7:$BD$\",7+$B$2)),2,FALSE))","v":""},{"$f":"BE8-BG8","v":{"$error":"#VALUE!"}}]

{"sheet":"TEMP","index":6,"n_rows":0,"n_cols":0,"rows_kept":0,"hidden":true}