{"text_format":"3","workbook":"xlsx","n_sheets":7,"sheets":["Reglement","Score","PremierLeague","Points","Classement","ClassementEQ","TEMP"],"not_rendered":{"images":2,"macros":1,"defined_names":310},"read":"whole","date_system":"1900"}

{"sheet":"Reglement","index":0,"n_rows":54,"n_cols":25,"rows_kept":54}
[{"$nulls":17},"Cotes",1,0,"English","Français","Español","Italiano","日本語"]
[{"$nulls":17},"Poules",null,null,"BARCLAYS PREMIER LEAGUE - 2019 / 2020","CHAMPIONNAT D'ANGLETERRE - PREMIER LEAGUE - SAISON 2019-2020","CAMPEONATO INGLES - PREMIER LEAGUE - 2019 / 2020","PREMIER LEAGUE - 2019 / 2020","PREMIER LEAGUE - 2019 / 2020"]
[null,null,{"$f":"\"CONCOURS 'Pronostics \"&R51&\"'\"","v":"CONCOURS 'Pronostics Premier League'"},{"$f":"\"CONTEST 'Prediction \"&R51&\"'\"","v":"CONTEST 'Prediction Premier League'"},{"$f":"\"CONCURSO 'Pronosticos \"&R51&\"'\"","v":"CONCURSO 'Pronosticos Premier League'"},{"$nulls":12},"\"Tout-pile\"",5,null,"ODDS","COTES","POSIBILIDADES","PROBABILITA","オッズ"]
[{"$nulls":17},"Bon prono",3,null,"Arsenal FC","Arsenal","Arsenal","Arsenal","アーセナル"]
[null,null,"OBJET DU CONCOURS","CONTEST PURPOSE","OBJETO DEL CONCURSO",{"$nulls":12},"Phase Finale",null,null,"Aston Villa","Aston Villa","Aston Villa","Aston Villa","アストン・ヴィラ"]
[{"$nulls":17},"\"Tout-pile\"",10,null,"AFC Bournemouth","Bournemouth","Bournemouth","Bournemouth","ボーンマス"]
{"$rows_left_out":49}
{"sheet":"Score","index":1,"n_rows":250,"n_cols":27,"rows_kept":250,"merged":[[1,5,2,22],[4,5,4,8],[4,19,4,22],[5,5,5,8],[5,19,5,22],[17,5,17,8],[17,19,17,22],[18,5,18,8],[18,19,18,22],[30,5,30,8],[30,19,30,22],[31,5,31,8],[31,19,31,22],[43,5,43,8],[43,19,43,22],[44,5,44,8],[44,19,44,22],[56,5,56,8],[56,19,56,22],[57,5,57,8],[57,19,57,22],[69,5,69,8],[69,19,69,22],[70,5,70,8],[70,19,70,22],[82,5,82,8],[82,19,82,22],[83,5,83,8],[83,19,83,22],[95,5,95,8],[95,19,95,22],[96,5,96,8],[96,19,96,22],[108,5,108,8],[108,19,108,22],[109,5,109,8],[109,19,109,22],[121,5,121,8],[121,19,121,22],[122,5,122,8],[122,19,122,22],[134,5,134,8],[134,19,134,22],[135,5,135,8],[135,19,135,22],[147,5,147,8],[147,19,147,22],[148,5,148,8],[148,19,148,22],[160,5,160,8],[160,19,160,22],[161,5,161,8],[161,19,161,22],[173,5,173,8],[173,19,173,22],[174,5,174,8],[174,19,174,22],[186,5,186,8],[186,19,186,22],[187,5,187,8],[187,19,187,22],[199,5,199,8],[199,19,199,22],[200,5,200,8],[200,19,200,22],[212,5,212,8],[212,19,212,22],[213,5,213,8],[213,19,213,22],[225,5,225,8],[225,19,225,22],[226,5,226,8],[226,19,226,22],[238,5,238,8],[238,19,238,22],[239,5,239,8],[239,19,239,22]]}
[]
[{"$nulls":5},{"$f":"UPPER(\"CHAMPIONNAT \"&Reglement!R53&\" - \"&Reglement!R51&\" - SAISON \"&Reglement!R52)","v":"CHAMPIONNAT D'ANGLETERRE - PREMIER LEAGUE - SAISON 2019-2020"}]
[]
[]
[{"$nulls":5},"JOURNEE n°1",{"$nulls":13},"JOURNEE n°20"]
[{"$nulls":5},"SAMEDI 10 AOÛT 2019",{"$nulls":13},"SAMEDI 28 DÉCEMBRE 2019"]
{"$rows_left_out":245}
{"sheet":"PremierLeague","index":2,"n_rows":69,"n_cols":27,"rows_kept":69,"merged":[[2,5,2,12],[2,13,2,19],[2,20,2,26]]}
[]
[]
[{"$nulls":5},"GENERAL",{"$nulls":7},"DOMICILE",{"$nulls":6},"EXTERIEUR"]
[{"$nulls":5},{"$f":"IF(Reglement!S34=\"Français\",\"Pts\",IF(Reglement!S34=\"Español\",\"Pts\",\"Pts\"))","v":"Pts"},{"$f":"IF(Reglement!S34=\"Français\",\"J\",IF(Reglement!S34=\"Español\",\"J\",\"P\"))","v":"J"},{"$f":"IF(Reglement!S34=\"Français\",\"G\",IF(Reglement!S34=\"Español\",\"G\",\"W\"))","v":"G"},{"$f":"IF(Reglement!S34=\"Français\",\"N\",IF(Reglement!S34=\"Español\",\"N\",\"D\"))","v":"N"},{"$f":"IF(Reglement!S34=\"Français\",\"P\",IF(Reglement!S34=\"Español\",\"P\",\"L\"))","v":"P"},{"$f":"IF(Reglement!S34=\"Français\",\"BP\",IF(Reglement!S34=\"Español\",\"BP\",\"G+\"))","v":"BP"},{"$f":"IF(Reglement!S34=\"Français\",\"BC\",IF(Reglement!S34=\"Español\",\"BC\",\"G-\"))","v":"BC"},{"$f":"IF(Reglement!S34=\"Français\",\"Diff.\",IF(Reglement!S34=\"Español\",\"Diff.\",\"G.A\"))","v":"Diff."},{"$f":"F4","v":"Pts"},{"$f":"H4","v":"G"},"N","P","BP","BC","Diff.","Pts",{"$f":"O4","v":"G"},"N","P","BP","BC","Diff."]
[null,null,1,{"$f":"B50","v":"Arsenal"},null,{"$f":"SUMIF(Score!$F$7:$F$250,D5,Score!$B$7:$B$250)+SUMIF(Score!$I$7:$I$250,D5,Score!$M$7:$M$250)+SUMIF(Score!$T$7:$T$250,D5,Score!$P$7:$P$250)+SUMIF(Score!$W$7:$W$250,D5,Score!$AA$7:$AA$250)","v":0},{"$f":"H5+I5+J5","v":0},{"$f":"SUMIF(Score!$F$7:$F$250,D5,Score!$C$7:$C$250)+SUMIF(Score!$I$7:$I$250,D5,Score!$J$7:$J$250)+SUMIF(Score!$T$7:$T$250,D5,Score!$Q$7:$Q$250)+SUMIF(Score!$W$7:$W$250,D5,Score!$X$7:$X$250)","v":0},{"$f":"SUMIF(Score!$F$7:$F$250,D5,Score!$D$7:$D$250)+SUMIF(Score!$I$7:$I$250,D5,Score!$K$7:$K$250)+SUMIF(Score!$T$7:$T$250,D5,Score!$R$7:$R$250)+SUMIF(Score!$W$7:$W$250,D5,Score!$Y$7:$Y$250)","v":0},{"$f":"SUMIF(Score!$F$7:$F$250,D5,Score!$E$7:$E$250)+SUMIF(Score!$I$7:$I$250,D5,Score!$L$7:$L$250)+SUMIF(Score!$T$7:$T$250,D5,Score!$S$7:$S$250)+SUMIF(Score!$W$7:$W$250,D5,Score!$Z$7:$Z$250)","v":0},{"$f":"SUMIF(Score!$F$7:$F$250,D5,Score!$G$7:$G$250)+SUMIF(Score!$I$7:$I$250,D5,Score!$H$7:$H$250)+SUMIF(Score!$T$7:$T$250,D5,Score!$U$7:$U$250)+SUMIF(Score!$W$7:$W$250,D5,Score!$V$7:$V$250)","v":0},{"$f":"SUMIF(Score!$F$7:$F$250,D5,Score!$H$7:$H$250)+SUMIF(Score!$I$7:$I$250,D5,Score!$G$7:$G$250)+SUMIF(Score!$T$7:$T$250,D5,Score!$V$7:$V$250)+SUMIF(Score!$W$7:$W$250,D5,Score!$U$7:$U$250)","v":0},{"$f":"K5-L5","v":0},{"$f":"SUMIF(Score!$F$7:$F$250,D5,Score!$B$7:$B$250)+SUMIF(Score!$T$7:$T$250,D5,Score!$P$7:$P$250)","v":0},{"$f":"SUMIF(Score!$F$7:$F$250,D5,Score!$C$7:$C$250)+SUMIF(Score!$T$7:$T$250,D5,Score!$Q$7:$Q$250)","v":0},{"$f":"SUMIF(Score!$F$7:$F$250,D5,Score!$D$7:$D$250)+SUMIF(Score!$T$7:$T$250,D5,Score!$R$7:$R$250)","v":0},{"$f":"SUMIF(Score!$F$7:$F$250,D5,Score!$E$7:$E$250)+SUMIF(Score!$T$7:$T$250,D5,Score!$S$7:$S$250)","v":0},{"$f":"SUMIF(Score!$F$7:$F$250,D5,Score!$G$7:$G$250)+SUMIF(Score!$T$7:$T$250,D5,Score!$U$7:$U$250)","v":0},{"$f":"SUMIF(Score!$F$7:$F$250,D5,Score!$H$7:$H$250)+SUMIF(Score!$T$7:$T$250,D5,Score!$V$7:$V$250)","v":0},{"$f":"R5-S5","v":0},{"$f":"SUMIF(Score!$I$7:$I$250,D5,Score!$M$7:$M$250)+SUMIF(Score!$W$7:$W$250,D5,Score!$AA$7:$AA$250)","v":0},{"$f":"SUMIF(Score!$I$7:$I$250,D5,Score!$J$7:$J$250)+SUMIF(Score!$W$7:$W$250,D5,Score!$X$7:$X$250)","v":0},{"$f":"SUMIF(Score!$I$7:$I$250,D5,Score!$K$7:$K$250)+SUMIF(Score!$W$7:$W$250,D5,Score!$Y$7:$Y$250)","v":0},{"$f":"SUMIF(Score!$I$7:$I$250,D5,Score!$L$7:$L$250)+SUMIF(Score!$W$7:$W$250,D5,Score!$Z$7:$Z$250)","v":0},{"$f":"SUMIF(Score!$I$7:$I$250,D5,Score!$H$7:$H$250)+SUMIF(Score!$W$7:$W$250,D5,Score!$V$7:$V$250)","v":0},{"$f":"SUMIF(Score!$I$7:$I$250,D5,Score!$G$7:$G$250)+SUMIF(Score!$W$7:$W$250,D5,Score!$U$7:$U$250)","v":0},{"$f":"Y5-Z5","v":0}]
[null,null,{"$f":"IF(AND(F6=F5,M5=M6,K5=K6),\"-\",2)","v":"-"},"Aston Villa",null,{"$f":"SUMIF(Score!$F$7:$F$250,D6,Score!$B$7:$B$250)+SUMIF(Score!$I$7:$I$250,D6,Score!$M$7:$M$250)+SUMIF(Score!$T$7:$T$250,D6,Score!$P$7:$P$250)+SUMIF(Score!$W$7:$W$250,D6,Score!$AA$7:$AA$250)","v":0},0,{"$f":"SUMIF(Score!$F$7:$F$250,D6,Score!$C$7:$C$250)+SUMIF(Score!$I$7:$I$250,D6,Score!$J$7:$J$250)+SUMIF(Score!$T$7:$T$250,D6,Score!$Q$7:$Q$250)+SUMIF(Score!$W$7:$W$250,D6,Score!$X$7:$X$250)","v":0},{"$f":"SUMIF(Score!$F$7:$F$250,D6,Score!$D$7:$D$250)+SUMIF(Score!$I$7:$I$250,D6,Score!$K$7:$K$250)+SUMIF(Score!$T$7:$T$250,D6,Score!$R$7:$R$250)+SUMIF(Score!$W$7:$W$250,D6,Score!$Y$7:$Y$250)","v":0},{"$f":"SUMIF(Score!$F$7:$F$250,D6,Score!$E$7:$E$250)+SUMIF(Score!$I$7:$I$250,D6,Score!$L$7:$L$250)+SUMIF(Score!$T$7:$T$250,D6,Score!$S$7:$S$250)+SUMIF(Score!$W$7:$W$250,D6,Score!$Z$7:$Z$250)","v":0},{"$f":"SUMIF(Score!$F$7:$F$250,D6,Score!$G$7:$G$250)+SUMIF(Score!$I$7:$I$250,D6,Score!$H$7:$H$250)+SUMIF(Score!$T$7:$T$250,D6,Score!$U$7:$U$250)+SUMIF(Score!$W$7:$W$250,D6,Score!$V$7:$V$250)","v":0},{"$f":"SUMIF(Score!$F$7:$F$250,D6,Score!$H$7:$H$250)+SUMIF(Score!$I$7:$I$250,D6,Score!$G$7:$G$250)+SUMIF(Score!$T$7:$T$250,D6,Score!$V$7:$V$250)+SUMIF(Score!$W$7:$W$250,D6,Score!$U$7:$U$250)","v":0},0,{"$f":"SUMIF(Score!$F$7:$F$250,D6,Score!$B$7:$B$250)+SUMIF(Score!$T$7:$T$250,D6,Score!$P$7:$P$250)","v":0},{"$f":"SUMIF(Score!$F$7:$F$250,D6,Score!$C$7:$C$250)+SUMIF(Score!$T$7:$T$250,D6,Score!$Q$7:$Q$250)","v":0},{"$f":"SUMIF(Score!$F$7:$F$250,D6,Score!$D$7:$D$250)+SUMIF(Score!$T$7:$T$250,D6,Score!$R$7:$R$250)","v":0},{"$f":"SUMIF(Score!$F$7:$F$250,D6,Score!$E$7:$E$250)+SUMIF(Score!$T$7:$T$250,D6,Score!$S$7:$S$250)","v":0},{"$f":"SUMIF(Score!$F$7:$F$250,D6,Score!$G$7:$G$250)+SUMIF(Score!$T$7:$T$250,D6,Score!$U$7:$U$250)","v":0},{"$f":"SUMIF(Score!$F$7:$F$250,D6,Score!$H$7:$H$250)+SUMIF(Score!$T$7:$T$250,D6,Score!$V$7:$V$250)","v":0},0,{"$f":"SUMIF(Score!$I$7:$I$250,D6,Score!$M$7:$M$250)+SUMIF(Score!$W$7:$W$250,D6,Score!$AA$7:$AA$250)","v":0},{"$f":"SUMIF(Score!$I$7:$I$250,D6,Score!$J$7:$J$250)+SUMIF(Score!$W$7:$W$250,D6,Score!$X$7:$X$250)","v":0},{"$f":"SUMIF(Score!$I$7:$I$250,D6,Score!$K$7:$K$250)+SUMIF(Score!$W$7:$W$250,D6,Score!$Y$7:$Y$250)","v":0},{"$f":"SUMIF(Score!$I$7:$I$250,D6,Score!$L$7:$L$250)+SUMIF(Score!$W$7:$W$250,D6,Score!$Z$7:$Z$250)","v":0},{"$f":"SUMIF(Score!$I$7:$I$250,D6,Score!$H$7:$H$250)+SUMIF(Score!$W$7:$W$250,D6,Score!$V$7:$V$250)","v":0},{"$f":"SUMIF(Score!$I$7:$I$250,D6,Score!$G$7:$G$250)+SUMIF(Score!$W$7:$W$250,D6,Score!$U$7:$U$250)","v":0},0]
{"$rows_left_out":64}
{"sheet":"Points","index":3,"n_rows":550,"n_cols":17,"rows_kept":550,"merged":[[1,4,2,5],[1,6,1,9],[1,10,1,12],[1,14,1,16],[2,10,2,11],[2,14,2,16],[5,0,14,0],[15,0,24,0],[25,0,34,0],[35,0,44,0],[45,0,54,0],[55,0,64,0],[65,0,74,0],[75,0,84,0],[85,0,94,0],[95,0,104,0],[105,0,114,0],[115,0,124,0],[125,0,134,0],[135,0,144,0],[145,0,154,0],[155,0,164,0],[165,0,174,0],[175,0,184,0],[185,0,194,0],[195,0,204,0],[205,0,214,0],[215,0,224,0],[225,0,234,0],[235,0,244,0],[245,0,254,0],[255,0,264,0],[265,0,274,0],[275,0,284,0],[285,0,294,0],[295,0,304,0],[305,0,314,0],[315,0,324,0],[325,0,334,0],[335,0,344,0],[345,0,354,0],[355,0,364,0],[365,0,374,0],[375,0,384,0],[393,1,403,1],[406,1,410,1],[411,1,421,1],[424,1,428,1]]}
[{"$f":"NOW()-0.077","v":"2019-07-26T09:56:51.820"},1]
[13,{"$f":"MAX(O387:XFD387)","v":1},null,null,"SCORE",null,"COTES"]
[null,{"$f":"MIN(IF($A$6:$A$65>$A$1,$B$6:$B$65))","v":0},{"$nulls":4},1,"N",2,"G",{"$f":"IF($K$4<>0,HLOOKUP(CONCATENATE($K$4,\"2\"),$O$4:$XFD390,387,FALSE),\"\")","v":""},null,{"$f":"IF($K$4<>0,VLOOKUP(K2,INDIRECT(CONCATENATE(\"Classement!D7:BD\",6+B2)),53,FALSE),\"\")","v":""},null,{"$f":"SUM(Q6:Q385)+Q478+Q439","v":0}]
[{"$nulls":10},{"$f":"K2","v":0},{"$f":"CONCATENATE(K4,\"1\")","v":"01"},{"$f":"CONCATENATE(K4,\"2\")","v":"02"},null,{"$f":"IF(O2<>\"\",O2,\"\")","v":""},{"$f":"CONCATENATE(O4,\"1\")","v":"1"},{"$f":"CONCATENATE(O4,\"2\")","v":"2"}]
[{"$nulls":10},{"$f":"HLOOKUP(K4,$O$4:$XFD5,2,FALSE)","v":{"$error":"#N/A"}}]
["JOURNEE n°1",null,{"$f":"Score!F7","v":"Liverpool"},{"$f":"Score!I7","v":"Norwich"},{"$f":"IF(Score!G7<>\"\",Score!G7,\"\")","v":""},{"$f":"IF(Score!H7<>\"\",Score!H7,\"\")","v":""},3.1,3,2.1,{"$f":"IF(OR(E6=\"\",F6=\"\"),\"\",IF(E6>F6,G6,IF(E6=F6,H6,I6)))","v":""},{"$f":"IF($K$4<>0,HLOOKUP($K$4,$O$4:$XFD6,ROW()-3,FALSE),\"\")","v":""},{"$f":"IF($K$4<>0,HLOOKUP(CONCATENATE($K$4,\"1\"),$O$4:$XFD6,ROW()-3,FALSE),\"\")","v":""},{"$f":"IF($K$4<>0,HLOOKUP(CONCATENATE($K$4,\"2\"),$O$4:$XFD6,ROW()-3,FALSE),\"\")","v":""},{"$nulls":3},{"$f":"IF(OR($E6=\"\",$F6=\"\",O6=\"\",P6=\"\"),\"\",IF(AND(O6=$E6,P6=$F6),Reglement!$S$3*$J6,IF(SIGN($E6-$F6)=SIGN(O6-P6),Reglement!$S$4*$J6,0))*IF(AND($E6+$F6>=6,O6+P6>=6),Reglement!$S$29,IF(AND($E6+$F6>=4,O6+P6>=4),Reglement!$S$28,1)))","v":""}]
{"$rows_left_out":486}
{"sheet":"Classement","index":4,"n_rows":8,"n_cols":65,"rows_kept":8,"merged":[[2,16,3,25],[2,26,3,30],[2,31,3,40],[2,41,3,45],[4,5,4,6],[4,56,4,57]]}
[null,{"$f":"MOD(B2,2)","v":1},{"$nulls":4},{"$f":"CONCATENATE(\"$G$7:$G$\",6+$B$2)","v":"$G$7:$G$7"},{"$f":"CONCATENATE(\"$H$7:$H$\",6+$B$2)","v":"$H$7:$H$7"},{"$f":"CONCATENATE(\"$I$7:$I$\",6+$B$2)","v":"$I$7:$I$7"},{"$f":"CONCATENATE(\"$J$7:$J$\",6+$B$2)","v":"$J$7:$J$7"},{"$f":"CONCATENATE(\"$K$7:$K$\",6+$B$2)","v":"$K$7:$K$7"},{"$f":"CONCATENATE(\"$L$7:$L$\",6+$B$2)","v":"$L$7:$L$7"},{"$f":"CONCATENATE(\"$M$7:$M$\",6+$B$2)","v":"$M$7:$M$7"},{"$f":"CONCATENATE(\"$N$7:$N$\",6+$B$2)","v":"$N$7:$N$7"},{"$f":"CONCATENATE(\"$O$7:$O$\",6+$B$2)","v":"$O$7:$O$7"},{"$f":"CONCATENATE(\"$P$7:$P$\",6+$B$2)","v":"$P$7:$P$7"},{"$f":"CONCATENATE(\"$Q$7:$Q$\",6+$B$2)","v":"$Q$7:$Q$7"},{"$f":"CONCATENATE(\"$R$7:$R$\",6+$B$2)","v":"$R$7:$R$7"},{"$f":"CONCATENATE(\"$S$7:$S$\",6+$B$2)","v":"$S$7:$S$7"},{"$f":"CONCATENATE(\"$T$7:$T$\",6+$B$2)","v":"$T$7:$T$7"},{"$f":"CONCATENATE(\"$U$7:$U$\",6+$B$2)","v":"$U$7:$U$7"},{"$f":"CONCATENATE(\"$V$7:$V$\",6+$B$2)","v":"$V$7:$V$7"},{"$f":"CONCATENATE(\"$W$7:$W$\",6+$B$2)","v":"$W$7:$W$7"},{"$f":"CONCATENATE(\"$X$7:$X$\",6+$B$2)","v":"$X$7:$X$7"},{"$f":"CONCATENATE(\"$Y$7:$Y$\",6+$B$2)","v":"$Y$7:$Y$7"},{"$f":"CONCATENATE(\"$Z$7:$Z$\",6+$B$2)","v":"$Z$7:$Z$7"},{"$f":"CONCATENATE(\"$AA$7:$AA$\",6+$B$2)","v":"$AA$7:$AA$7"},{"$f":"CONCATENATE(\"$AB$7:$AB$\",6+$B$2)","v":"$AB$7:$AB$7"},{"$f":"CONCATENATE(\"$AC$7:$AC$\",6+$B$2)","v":"$AC$7:$AC$7"},{"$f":"CONCATENATE(\"$AD$7:$AD$\",6+$B$2)","v":"$AD$7:$AD$7"},{"$f":"CONCATENATE(\"$AE$7:$AE$\",6+$B$2)","v":"$AE$7:$AE$7"},{"$f":"CONCATENATE(\"$AF$7:$AF$\",6+$B$2)","v":"$AF$7:$AF$7"},{"$f":"CONCATENATE(\"$AG$7:$AG$\",6+$B$2)","v":"$AG$7:$AG$7"},{"$f":"CONCATENATE(\"$AH$7:$AH$\",6+$B$2)","v":"$AH$7:$AH$7"},{"$f":"CONCATENATE(\"$AI$7:$AI$\",6+$B$2)","v":"$AI$7:$AI$7"},{"$f":"CONCATENATE(\"$AJ$7:$AJ$\",6+$B$2)","v":"$AJ$7:$AJ$7"},{"$f":"CONCATENATE(\"$AK$7:$AK$\",6+$B$2)","v":"$AK$7:$AK$7"},{"$f":"CONCATENATE(\"$AL$7:$AL$\",6+$B$2)","v":"$AL$7:$AL$7"},{"$f":"CONCATENATE(\"$AM$7:$AM$\",6+$B$2)","v":"$AM$7:$AM$7"},{"$f":"CONCATENATE(\"$AN$7:$AN$\",6+$B$2)","v":"$AN$7:$AN$7"},{"$f":"CONCATENATE(\"$AO$7:$AO$\",6+$B$2)","v":"$AO$7:$AO$7"},{"$f":"CONCATENATE(\"$AP$7:$AP$\",6+$B$2)","v":"$AP$7:$AP$7"},{"$f":"CONCATENATE(\"$AQ$7:$AQ$\",6+$B$2)","v":"$AQ$7:$AQ$7"},{"$f":"CONCATENATE(\"$AR$7:$AR$\",6+$B$2)","v":"$AR$7:$AR$7"},{"$f":"CONCATENATE(\"$AS$7:$AS$\",6+$B$2)","v":"$AS$7:$AS$7"},{"$f":"CONCATENATE(\"$AT$7:$AT$\",6+$B$2)","v":"$AT$7:$AT$7"},{"$f":"CONCATENATE(\"$AU$7:$AU$\",6+$B$2)","v":"$AU$7:$AU$7"},{"$f":"CONCATENATE(\"$AV$7:$AV$\",6+$B$2)","v":"$AV$7:$AV$7"},{"$f":"CONCATENATE(\"$AW$7:$AW$\",6+$B$2)","v":"$AW$7:$AW$7"},{"$f":"CONCATENATE(\"$AX$7:$AX$\",6+$B$2)","v":"$AX$7:$AX$7"},{"$f":"CONCATENATE(\"$AY$7:$AY$\",6+$B$2)","v":"$AY$7:$AY$7"},{"$f":"CONCATENATE(\"$AZ$7:$AZ$\",6+$B$2)","v":"$AZ$7:$AZ$7"},{"$f":"CONCATENATE(\"$BA$7:$BA$\",6+$B$2)","v":"$BA$7:$BA$7"},{"$f":"CONCATENATE(\"$BB$7:$BB$\",6+$B$2)","v":"$BB$7:$BB$7"},{"$nulls":5},{"$f":"CONCATENATE(\"$BH$7:$BH$\",6+$B$2)","v":"$BH$7:$BH$7"},{"$nulls":4},{"$f":"CONCATENATE(\"$BM$7:$BM$\",6+$B$2)","v":"$BM$7:$BM$7"}]
[null,{"$f":"MAX(Points!O387:XFD387)","v":1}]
[null,{"$f":"Points!K2","v":0}]
[null,{"$f":"CONCATENATE(\"$C$7:$X$\",6+B2)","v":"$C$7:$X$7"}]
[null,{"$f":"SUBTOTAL(3,D:D)-1","v":2},"RANG","NOM","EQUIPE","EVOL.",null,"POINTS","FIABILITE","DETAIL","TOUT-PILE","MAX PTS / \nMATCH","MAX PTS / \nJOURNEE","Nb Journées\nGagnées","BONUS","R.O.I","J1","J2","J3","J4","J5","J6","J7","J8","J9","J10","J11","J12","J13","J14","J15","J16","J17","J18","J19","J20","J21","J22","J23","J24","J25","J26","J27","J28","J29","J30","J31","J32","J33","J34","J35","J36","J37","J38","Colonne",null,"Ancien Classement",null,"Actuel","Evol",{"$f":"AVERAGE(INDIRECT(CONCATENATE(\"BI7:BI\",6+B2)))","v":1}]
[{"$nulls":7},-1]
{"$rows_left_out":3}
{"sheet":"ClassementEQ","index":5,"n_rows":8,"n_cols":60,"rows_kept":8,"merged":[[2,16,3,25],[2,26,3,30],[2,31,3,40],[2,41,3,45],[4,5,4,6],[4,56,4,57]]}
[null,{"$f":"Classement!B2","v":1},null,{"$f":"CONCATENATE(\"Points!$H$540:$K$\",539+B2)","v":"Points!$H$540:$K$539"},{"$f":"CONCATENATE(\"Points!$H$540:$I$\",539+B2)","v":"Points!$H$540:$I$539"},null,{"$f":"CONCATENATE(\"$G$7:$G$\",6+$B$2)","v":"$G$7:$G$6"},{"$f":"CONCATENATE(\"$H$7:$H$\",6+$B$2)","v":"$H$7:$H$6"},{"$f":"CONCATENATE(\"$I$7:$I$\",6+$B$2)","v":"$I$7:$I$6"},{"$f":"CONCATENATE(\"$J$7:$J$\",6+$B$2)","v":"$J$7:$J$6"},{"$f":"CONCATENATE(\"$K$7:$K$\",6+$B$2)","v":"$K$7:$K$6"},{"$f":"CONCATENATE(\"$L$7:$L$\",6+$B$2)","v":"$L$7:$L$6"},{"$f":"CONCATENATE(\"$M$7:$M$\",6+$B$2)","v":"$M$7:$M$6"},{"$f":"CONCATENATE(\"$N$7:$N$\",6+$B$2)","v":"$N$7:$N$6"},{"$f":"CONCATENATE(\"$O$7:$O$\",6+$B$2)","v":"$O$7:$O$6"},{"$f":"CONCATENATE(\"$P$7:$P$\",6+$B$2)","v":"$P$7:$P$6"},{"$f":"CONCATENATE(\"$Q$7:$Q$\",6+$B$2)","v":"$Q$7:$Q$6"},{"$f":"CONCATENATE(\"$R$7:$R$\",6+$B$2)","v":"$R$7:$R$6"},{"$f":"CONCATENATE(\"$S$7:$S$\",6+$B$2)","v":"$S$7:$S$6"},{"$f":"CONCATENATE(\"$T$7:$T$\",6+$B$2)","v":"$T$7:$T$6"},{"$f":"CONCATENATE(\"$U$7:$U$\",6+$B$2)","v":"$U$7:$U$6"},{"$f":"CONCATENATE(\"$V$7:$V$\",6+$B$2)","v":"$V$7:$V$6"},{"$f":"CONCATENATE(\"$W$7:$W$\",6+$B$2)","v":"$W$7:$W$6"},{"$f":"CONCATENATE(\"$X$7:$X$\",6+$B$2)","v":"$X$7:$X$6"},{"$f":"CONCATENATE(\"$Y$7:$Y$\",6+$B$2)","v":"$Y$7:$Y$6"},{"$f":"CONCATENATE(\"$Z$7:$Z$\",6+$B$2)","v":"$Z$7:$Z$6"},{"$f":"CONCATENATE(\"$AA$7:$AA$\",6+$B$2)","v":"$AA$7:$AA$6"},{"$f":"CONCATENATE(\"$AB$7:$AB$\",6+$B$2)","v":"$AB$7:$AB$6"},{"$f":"CONCATENATE(\"$AC$7:$AC$\",6+$B$2)","v":"$AC$7:$AC$6"},{"$f":"CONCATENATE(\"$AD$7:$AD$\",6+$B$2)","v":"$AD$7:$AD$6"},{"$f":"CONCATENATE(\"$AE$7:$AE$\",6+$B$2)","v":"$AE$7:$AE$6"},{"$f":"CONCATENATE(\"$AF$7:$AF$\",6+$B$2)","v":"$AF$7:$AF$6"},{"$f":"CONCATENATE(\"$AG$7:$AG$\",6+$B$2)","v":"$AG$7:$AG$6"},{"$f":"CONCATENATE(\"$AH$7:$AH$\",6+$B$2)","v":"$AH$7:$AH$6"},{"$f":"CONCATENATE(\"$AI$7:$AI$\",6+$B$2)","v":"$AI$7:$AI$6"},{"$f":"CONCATENATE(\"$AJ$7:$AJ$\",6+$B$2)","v":"$AJ$7:$AJ$6"},{"$f":"CONCATENATE(\"$AK$7:$AK$\",6+$B$2)","v":"$AK$7:$AK$6"},{"$f":"CONCATENATE(\"$AL$7:$AL$\",6+$B$2)","v":"$AL$7:$AL$6"},{"$f":"CONCATENATE(\"$AM$7:$AM$\",6+$B$2)","v":"$AM$7:$AM$6"},{"$f":"CONCATENATE(\"$AN$7:$AN$\",6+$B$2)","v":"$AN$7:$AN$6"},{"$f":"CONCATENATE(\"$AO$7:$AO$\",6+$B$2)","v":"$AO$7:$AO$6"},{"$f":"CONCATENATE(\"$AP$7:$AP$\",6+$B$2)","v":"$AP$7:$AP$6"},{"$f":"CONCATENATE(\"$AQ$7:$AQ$\",6+$B$2)","v":"$AQ$7:$AQ$6"},{"$f":"CONCATENATE(\"$AR$7:$AR$\",6+$B$2)","v":"$AR$7:$AR$6"},{"$f":"CONCATENATE(\"$AS$7:$AS$\",6+$B$2)","v":"$AS$7:$AS$6"},{"$f":"CONCATENATE(\"$AT$7:$AT$\",6+$B$2)","v":"$AT$7:$AT$6"},{"$f":"CONCATENATE(\"$AU$7:$AU$\",6+$B$2)","v":"$AU$7:$AU$6"},{"$f":"CONCATENATE(\"$AV$7:$AV$\",6+$B$2)","v":"$AV$7:$AV$6"},{"$f":"CONCATENATE(\"$AW$7:$AW$\",6+$B$2)","v":"$AW$7:$AW$6"},{"$f":"CONCATENATE(\"$AX$7:$AX$\",6+$B$2)","v":"$AX$7:$AX$6"},{"$f":"CONCATENATE(\"$AY$7:$AY$\",6+$B$2)","v":"$AY$7:$AY$6"},{"$f":"CONCATENATE(\"$AZ$7:$AZ$\",6+$B$2)","v":"$AZ$7:$AZ$6"},{"$f":"CONCATENATE(\"$BA$7:$BA$\",6+$B$2)","v":"$BA$7:$BA$6"},{"$f":"CONCATENATE(\"$BB$7:$BB$\",6+$B$2)","v":"$BB$7:$BB$6"},{"$nulls":5},{"$f":"CONCATENATE(\"$BH$7:$BH$\",6+$B$2)","v":"$BH$7:$BH$6"}]
[null,{"$f":"Points!M392","v":0}]
[null,{"$f":"Points!K5","v":{"$error":"#N/A"}}]
[null,{"$f":"CONCATENATE(\"$C$7:$X$\",6+B2)","v":"$C$7:$X$6"}]
[null,null,"RANG","EQUIPE","Nbr Joueurs","EVOL",null,"MOY. POINTS","FIABILITE","DETAIL","MOY. TOUT-PILE","POINTS MAX","POINTS MIN","MEILLEUR CLASS.","PIRE CLASS.","MOY.  R.O.I","J1","J2","J3","J4","J5","J6","J7","J8","J9","J10","J11","J12","J13","J14","J15","J16","J17","J18","J19","J20","J21","J22","J23","J24","J25","J26","J27","J28","J29","J30","J31","J32","J33","J34","J35","J36","J37","J38","Colonne",null,"Ancien Classement",null,"Actuel","Evol"]
[{"$nulls":7},-1]
{"$rows_left_out":3}
{"sheet":"TEMP","index":6,"n_rows":0,"n_cols":0,"rows_kept":0,"hidden":true}